{"text_format":"1","workbook":"xlsx","n_sheets":15,"sheets":["INGESTA MS caprino","ENERGIA caprino","PROTEINA caprino","INGESTA MS ovino","ENERGIA ovino","PROTEINA ovino","MATERIAS PRIMAS","FUENTE DATOS Y ECUACIONES","ENLACES DATOS","RACIONES","PIENSOS","HACER RACION","INFORMACION NUTRIENTES","HOJA DE AYUDA","MODULO"],"not_rendered":{"charts":2,"images":28,"macros":1,"external_links":2,"defined_names":6,"comments":9,"pivot_tables":0},"unopened":[],"bounds":{"document_bytes":16777216,"sheet_cells":100000,"rows_first":2000,"rows_last":500,"rows_between":2000,"halvings":0,"cell_chars":16384,"cell_head_chars":4096},"cells_cut":0,"cells_raw":0,"read":"whole","date_system":"1900"}

{"sheet":"INGESTA MS caprino","index":0,"n_rows":153,"n_cols":5,"rows_kept":153,"cut":false,"hidden":false,"merged":[]}
[]
[null,"GANADO CAPRINO",null,"FEDNA 2009"]
[]
[]
["INGESTA MATERIA SECA (IMS)"]
[]
[]
[]
[]
[]
[]
[]
[]
[]
[]
[]
[]
[]
[]
[]
[]
[]
[]
[]
[]
[]
[]
[]
[]
[]
[]
[]
[]
[null,"PV",{"$f":"IF('ENLACES DATOS'!G85=\"\",0,'ENLACES DATOS'!G85)","v":0},"Kg"]
[null,"PL ",{"$f":"IF('ENLACES DATOS'!G86=\"\",0,'ENLACES DATOS'!G86)","v":0},"litros"]
[null,"GB",{"$f":"IF('ENLACES DATOS'!G87=\"\",0,'ENLACES DATOS'!G87)","v":0},"gr"]
[null,"PB",{"$f":"IF('ENLACES DATOS'!G88=\"\",0,'ENLACES DATOS'!G88)","v":0},"gr"]
[null,"L",{"$f":"IF(C35=0,0,39)","v":0},"gr"]
[null,"t",{"$f":"IF(C35=\"\",\"\",'ENLACES DATOS'!G90*4)","v":{"$error":"#VALUE!"}}]
[]
[]
[null,"PVmetabólico",{"$f":"IF(C34=\"\",\"\",POWER(C34,0.75))","v":0},"Kg"]
[null,"PLE(a 5.88%MG)",{"$f":"IF($C$35=\"\",\"\",((((38*$C$36)+(24.44*$C$37)+(16.45*$C$38))/1000)*$C$35)/3.59)","v":0},"litros"]
[]
[null,"ECUACIONES IMS"]
[null,"DIETAS SILO MAIZ",{"$f":"IF(C34=\"\",\"\",((165+(368.6*C35)+(34.8*C42)))/1000)","v":0.16500000000000001},"Kg MS","Sauvant 8 primeras semanas"]
[null,"DIETAS SILO MAIZ",{"$f":"IF(C34=\"\",\"\",(533+(305.2*C35)+(13.3*C34))/1000)","v":0.53300000000000003},"Kg MS","Sauvant 8-19 semanas"]
[null,"DIETAS SILO HIERBA",{"$f":"IF($C$35=\"\",\"\",((0.305*((((38*$C$36)+(24.44*$C$37)+(16.45*$C$38))/1000)*$C$35)/2.84))+(0.062*C42))","v":0},"Kg MS","UK. 2º mes lactacion"]
[null,"MURCIANA ",{"$f":"IF(C42=\"\",\"\",((0.022*C43)+(0.107*C42))*C150)","v":{"$error":"#VALUE!"}},"Kg MS","Fernandez.Ración Completa. Toda la lactacion"]
[null,"MURCIANA ",{"$f":"IF(C42=\"\",\"\",(0.111*C42)*C153)","v":{"$error":"#VALUE!"}},"Kg MS","Fernandez. Ración Completa. Toda la lactacion"]
[]
[]
[]
[]
[]
[]
[]
[]
[]
[]
[]
[]
[]
[]
[]
[]
[]
[]
[]
[]
[]
[]
[]
[]
[]
[]
[]
[]
[]
[]
[]
[]
[]
[]
[]
[]
[]
[]
[]
[]
[]
[]
[]
[]
[]
[]
[]
[]
[]
[]
[]
[]
[]
[]
[]
[]
[]
[]
[]
[]
[]
[]
[]
[]
[]
[]
[]
[]
[]
[]
[]
[]
[]
[]
[]
[]
[]
[]
[]
[]
[]
[]
[]
[]
[]
[]
[]
[]
[]
[]
[]
[]
[]
[]
[]
[]
[]
[]
[null,null,{"$f":"-0.444*(C39+7.221)","v":{"$error":"#VALUE!"}}]
[null,null,{"$f":"1-(EXP(C149))","v":{"$error":"#VALUE!"}}]
[]
[null,null,{"$f":"-0.8*C39","v":{"$error":"#VALUE!"}}]
[null,null,{"$f":"1-(EXP(C152))","v":{"$error":"#VALUE!"}}]

{"sheet":"ENERGIA caprino","index":1,"n_rows":146,"n_cols":11,"rows_kept":146,"cut":false,"hidden":false,"merged":[]}
[]
[null,"GANADO CAPRINO",null,"FEDNA 2009",null,null,null,"     GANADO CAPRINO",null,null,"FEDNA 2009"]
[]
[]
["ENERGIA",null,null,null,null,null,null,"ENERGIA"]
[]
[]
[]
[]
[]
[]
[]
[]
[]
[]
[]
[]
[]
[]
[]
[]
[]
[]
[]
[]
[]
[null,"PV",{"$f":"IF('ENLACES DATOS'!G85=\"\",0,'ENLACES DATOS'!G85)","v":0},"Kg"]
[null,"PL ",{"$f":"IF('ENLACES DATOS'!G86=\"\",0,'ENLACES DATOS'!G86)","v":0},"litros"]
[null,"GB",{"$f":"IF('ENLACES DATOS'!G87=\"\",0,'ENLACES DATOS'!G87)","v":0},"gr"]
[null,"PB",{"$f":"IF('ENLACES DATOS'!G88=\"\",0,'ENLACES DATOS'!G88)","v":0},"gr"]
[null,"L",{"$f":"IF(C28=0,0,39)","v":0},"gr"]
[null,"t",{"$f":"IF('ENLACES DATOS'!G90=\"\",0,'ENLACES DATOS'!G90*4)","v":0}]
[null,"d",{"$f":"IF('ENLACES DATOS'!G91=\"\",0,'ENLACES DATOS'!G91)","v":0},"Km"]
[null,"Mes Gestacion",{"$f":"IF('ENLACES DATOS'!G89=\"\",0,'ENLACES DATOS'!G89)","v":0},"m"]
[]
[]
[]
[]
[]
[]
[null,null,"MJ EM","Mcal ENL","UFL ENL"]
[null,"EM Mantenimiento",{"$f":"IF(C27=\"\",\"\",(0.401*J47))","v":0},{"$f":"IF(C42=\"\",\"\",((C42*0.67)*0.24))","v":0},{"$f":"IF(D42=\"\",\"\",D42/1.7)","v":0}]
[null,"EM Mantenimiento",{"$f":"IF(C27=\"\",\"\",IF(C27>45,0,(0.421*J47)))","v":0},{"$f":"IF(C43=\"\",\"\",((C43*0.67)*0.24))","v":0},0]
[null,"EM Mantenimiento",{"$f":"IF(C27=\"\",\"\",(0.443*J47))","v":0},{"$f":"IF(C44=\"\",\"\",((C44*0.67)*0.24))","v":0},0]
[null,"EM Gestacion",{"$f":"IF(C34=0,0,VLOOKUP(C34,B143:C146,2,FALSE))","v":0},{"$f":"IF(C45=\"\",\"\",((C45*0.36)*0.24))","v":0},0]
[null,"EM Lactacion",{"$f":"IF(C28=\"\",0,(5.38*C28))","v":0},{"$f":"IF(C46=\"\",\"\",((C46*0.667)*0.24))","v":0},0]
[null,"EM reservas (mov)",{"$f":"IF(C32>5.9,0,(IF(C32<1,0,(((7.87-(1.02*C32)+(0.027*(C32*C32)))))*(-1))))","v":0},{"$f":"IF(C47=\"\",\"\",((C47*0.79)*0.24))","v":0},0,null,null,null,"PVmetabólico",{"$f":"IF(C27=\"\",\"\",POWER(C27,0.75))","v":0},"Kg"]
[null,"EM Locomoción",{"$f":"IF(C33=\"\",0,((3.35*C27*C33)/1000))","v":0},{"$f":"IF(C48=\"\",\"\",((C48*0.67)*0.24))","v":0},{"$f":"IF(D48=\"\",\"\",D48/1.7)","v":0},null,null,null,"ENL leche",{"$f":"IF($C$28=\"\",\"\",((((38*$C$29)+(24.44*$C$30)+(16.45*$C$31))/1000)))","v":0},"MJ/Kg"]
[null,"EM Termorregulacion",{"$f":"IF(C42=\"\",\"\",1.98*C42)","v":0},{"$f":"IF(C49=\"\",\"\",((C49*0.67)*0.24))","v":0},0,null,null,null,"ENL leche",{"$f":"IF(J48=\"\",\"\",J48/7.11)","v":0},"UFL"]
[null,null,null,null,null,null,null,null,"PLE(a 5.88%MG)",{"$f":"IF($C$28=\"\",\"\",((((38*$C$29)+(24.44*$C$30)+(16.45*$C$31))/1000)*$C$28)/3.59)","v":0},"litros"]
[null,"NECESIDADES TOTALES",{"$f":"IF(C42=\"\",\"\",C42+C45+C46+C47+C48)","v":0},{"$f":"IF(C51=\"\",\"\",((C51*0.67)*0.24))","v":0},{"$f":"IF(D51=\"\",\"\",D51/1.7)","v":0},null,null,null,"PLE(a 3.55%MG)",{"$f":"IF($C$28=\"\",\"\",((((38*$C$29)+(24.44*$C$30)+(16.45*$C$31))/1000)*$C$28)/2.84)","v":0},"litros"]
[]
[]
[]
[]
[]
[]
[]
[]
[null,"GANADO CAPRINO",null,"FEDNA 2009"]
[]
[]
["ENERGIA"]
[]
[]
[]
[]
[]
[]
[]
[]
[]
[]
[]
[]
[]
[]
[]
[]
[]
[]
[]
[]
[]
[]
[]
[]
[]
[]
[]
[]
[]
[]
[]
[]
[]
[]
[]
[]
[]
[]
[]
[]
[]
[]
[]
[]
[]
[]
[]
[]
[]
[]
[]
[]
[]
[]
[]
[]
[]
[]
[]
[]
[]
[]
[]
[]
[]
[]
[]
[]
[]
[]
[]
[]
[]
[]
[]
[]
[]
[]
[]
[null,"4º Mes, 40KgPV",1.04]
[null,"4º Mes, 50KgPV",1.35]
[null,"5º Mes, 40KgPV",2.27]
[null,"5º Mes, 50KgPV",2.59]

{"sheet":"PROTEINA caprino","index":2,"n_rows":156,"n_cols":9,"rows_kept":156,"cut":false,"hidden":false,"merged":[]}
[]
[null,"GANADO CAPRINO",null,"FEDNA 2009"]
[]
[]
["PROTEINA (PDI)"]
[]
[]
[]
[]
[]
[]
[]
[]
[]
[]
[]
[]
[]
[]
[]
[]
[]
[]
[]
[]
[]
[]
[]
[]
[]
[]
[]
[]
[]
[]
[]
[]
[null,"PV",{"$f":"IF('ENLACES DATOS'!G85=\"\",0,'ENLACES DATOS'!G85)","v":0},"Kg"]
[null,"PL ",{"$f":"IF('ENLACES DATOS'!G86=\"\",0,'ENLACES DATOS'!G86)","v":0},"litros"]
[null,"Mes de Gestación",{"$f":"IF(G40=\"\",\"\",VLOOKUP(G40,H40:I43,2,FALSE))","v":""},null,null,null,{"$f":"IF('ENLACES DATOS'!G89=\"\",\"\",'ENLACES DATOS'!G89)","v":""},"4º Mes, 40KgPV","4ºMES"]
[null,"Mes de Lactacion",{"$f":"IF('ENLACES DATOS'!G90=\"\",0,'ENLACES DATOS'!G90)","v":0},"gr",null,null,null,"4º Mes, 50KgPV","4ºMES"]
[null,null,null,null,null,null,null,"5º Mes, 40KgPV","5ºMES"]
[null,null,null,null,null,null,null,"5º Mes, 50KgPV","5ºMES"]
[]
[null,"PVmetabólico",{"$f":"IF(C38=\"\",\"\",POWER(C38,0.75))","v":0},"Kg"]
[]
[]
[]
[null,"grPDI Mantenim.",{"$f":"IF($C$38=\"\",\"\",2.99*$C$45)","v":0},"grPDI"]
[null,"grPDI Mantenim.",{"$f":"IF($C$38=\"\",\"\",2.56*$C$45)","v":0},"grPDI"]
[null,"grPDI Gestación",{"$f":"IF(C40=\"\",0,((VLOOKUP(C40,B155:C156,2,FALSE))*C49)-C49)","v":0},"grPDI"]
[null,"grPDI Lactación",{"$f":"IF(C39=\"\",0,(35*C39)/0.68)","v":0},"grPDI"]
[null,"grPDI Reservas",{"$f":"IF(C41=0,0,IF(C41<3.9,-30,4))","v":0},"grPDI"]
[null,"grPDI TOTALES",{"$f":"IF(C38=\"\",\"\",C49+C51+C52+C53)","v":0},"grPDI"]
[]
[]
[]
[]
[]
[]
[]
[]
[]
[]
[]
[]
[]
[]
[]
[]
[]
[]
[]
[]
[]
[]
[]
[]
[]
[]
[]
[]
[]
[]
[]
[]
[]
[]
[]
[]
[]
[]
[]
[]
[]
[]
[]
[]
[]
[]
[]
[]
[]
[]
[]
[]
[]
[]
[]
[]
[]
[]
[]
[]
[]
[]
[]
[]
[]
[]
[]
[]
[]
[]
[]
[]
[]
[]
[]
[]
[]
[]
[]
[]
[]
[]
[]
[]
[]
[]
[]
[]
[]
[]
[]
[]
[]
[]
[]
[]
[]
[]
[]
[]
[null,"4ºMES",1.6]
[null,"5ºMES",2.2000000000000002]

{"sheet":"INGESTA MS ovino","index":3,"n_rows":47,"n_cols":4,"rows_kept":47,"cut":false,"hidden":false,"merged":[]}
[]
[null,"GANADO OVINO",null,"FEDNA 2009"]
[]
[]
["INGESTA MATERIA SECA (IMS)"]
[]
[]
[]
[]
[]
[]
[]
[]
[]
[]
[]
[]
[]
[]
[]
[]
[]
[]
[]
[]
[]
[]
[]
[]
[]
[]
[]
[]
[null,"PV",{"$f":"IF('ENLACES DATOS'!G93=\"\",0,'ENLACES DATOS'!G93)","v":0},"Kg"]
[null,"PVc",0,"gr"]
[null,"PLS",{"$f":"IF('ENERGIA ovino'!C40=\"\",0,'ENERGIA ovino'!I48)","v":0},"litros"]
[null,"K",{"$f":"IF(C34=0,0,1)","v":0}," "]
[null,"TEMPERATURA",{"$f":"IF('ENLACES DATOS'!G99=\"\",\"\",'ENLACES DATOS'!G99)","v":""},"ºC"]
[]
[]
[]
[null,"PVmetabólico",{"$f":"IF(C34=\"\",\"\",POWER(C34,0.75))","v":0},"Kg"]
[]
[null,"IMS Secas",{"$f":"IF(C34=\"\",\"\",(-0.545+(0.095*C42)+(0.005*C35))*C37)","v":0},"Kg MS"]
[null,"IMS Lactación",{"$f":"IF(C35=\"\",\"\",(-0.545+(0.095*C42)+(0.65*C36)+(0.0025*C35))*C37)","v":0},"Kg MS"]
[null,"Correccion Tª",{"$f":"IF(C34=\"\",\"\",IF(C38=\"\",0,(IF(C38<25,0,(C38-25)*0.02)*C45)))","v":0},"Kg MS"]
[null,"IMS",{"$f":"IF(C45=\"\",\"\",C45-C46)","v":0},"Kg MS"]

{"sheet":"ENERGIA ovino","index":4,"n_rows":142,"n_cols":10,"rows_kept":142,"cut":false,"hidden":false,"merged":[]}
[]
[null,"GANADO OVINO",null,"FEDNA 2009",null,null,null,"GANADO OVINO",null,"FEDNA 2009"]
[]
[]
["ENERGÍA (ENL)",null,null,null,null,null,"ENERGÍA (ENL)"]
[]
[]
[]
[]
[]
[]
[]
[]
[]
[]
[]
[]
[]
[]
[]
[]
[]
[]
[]
[]
[]
[]
[]
[]
[]
[null,null,null,null,"EB","PLS"]
[null,null,null,"MANCHEGA",{"$f":"IF(C41=\"\",\"\",(111.1*C41)+409.7)","v":409.7},{"$f":"IF(C40=\"\",\"\",C40*((0.098*C41)+0.36))","v":0}]
[null,null,null,"LACAUNE/ASSAF",{"$f":"IF(C41=\"\",\"\",(99.96*C41)+450.5)","v":450.5},{"$f":"IF(C40=\"\",\"\",C40*((0.091*C41)+0.41))","v":0}]
[]
[]
[]
[]
[null,"RAZA",{"$f":"IF('ENLACES DATOS'!G92=\"\",\"\",'ENLACES DATOS'!G92)","v":""}," "]
[null,"PV",{"$f":"IF('ENLACES DATOS'!G93=\"\",0,'ENLACES DATOS'!G93)","v":0},"Kg"]
[null,"PL",{"$f":"IF('ENLACES DATOS'!G94=\"\",0,'ENLACES DATOS'!G94)","v":0},"litros"]
[null,"%MG",{"$f":"IF('ENLACES DATOS'!G95=\"\",0,'ENLACES DATOS'!G95/10)","v":0},"%"]
[null,"Pc",{"$f":"IF('ENLACES DATOS'!G97=\"\",0,'ENLACES DATOS'!G97)","v":0},"Kg"]
[null,"t (dias gestacion)",{"$f":"IF('ENLACES DATOS'!G98=\"\",0,'ENLACES DATOS'!G98)","v":0},"dias"]
[null,"CC (Estado Corporal)",null," "]
[null,"PERDIDA CC",null," "]
[null,"TIEMPO PERDIDA",null,"días"]
[null,"KG RECUPERACION",null,"KgPV",null,null,null,"PVmetabólico",{"$f":"IF(C39=\"\",\"\",POWER(C39,0.75))","v":0},"Kg"]
[null,"TIEMPO REC",null,"dias",null,null,null,"PLS",{"$f":"IF(C40=0,0,VLOOKUP($C$38,$D$31:$F$33,3,FALSE))","v":0},"litros"]
[null,null,null,null,null,null,null,"EB (Energía Bruta de leche)",{"$f":"IF(C41=\"\",\"\",VLOOKUP($C$38,$D$31:$F$33,2,FALSE))","v":{"$error":"#N/A"}},"Kcal/kg leche"]
[null,null,null,null,"UFL",null,null,"PVV (PV vacío)",{"$f":"IF(C39=\"\",\"\",0.817*C39)","v":0},"Kg"]
[null,"ENL Mantenim",{"$f":"IF(I47=\"\",\"\",57.5*I47)","v":0},"Kcal/día",{"$f":"IF(C51=\"\",\"\",C51/1700)","v":0},null,null,"AG (% grasa corporal)",{"$f":"IF(C44=\"\",\"\",0.0269+(0.0869*C44))","v":""},"%"]
[null,"ENL Lactacion",{"$f":"IF(I48=\"\",\"\",1132*I48)","v":0},"Kcal/día",{"$f":"IF(C52=\"\",\"\",C52/1700)","v":0},null,null,"AP (% proteína corporal)",{"$f":"IF(C44=\"\",\"\",(-0.0039*(C44*C44))+(0.0279*C44)+0.1449)","v":""},"%"]
[null,"ENL Gestación",{"$f":"IF(C42=\"\",\"\",((9248*C42*C142)*4.9))","v":0},"Kcal/día",{"$f":"IF(C53=\"\",\"\",C53/1700)","v":0},null,null,"TG (total grasa corp)",{"$f":"IF(I51=\"\",\"\",I51*I50)","v":""},"Kg"]
[null,"ENL Pérdida Peso",{"$f":"IF(C45=\"\",0,((((0.13*C45*C39)*I57)/C46)*1000)*-1)","v":0},"Kcal/día",{"$f":"IF(C54=\"\",\"\",C54/1700)","v":0},null,null,"TP(total proteína corp)",{"$f":"IF(I52=\"\",\"\",I52*I50)","v":""},"Kg"]
[null,"ENL Ganancia Peso",{"$f":"IF(C47=\"\",0,((C47*I58)/C48)*1000)","v":0},"Kcal/día",{"$f":"IF(C55=\"\",\"\",C55/1700)","v":0},null,null,"ET (Energia Total)",{"$f":"IF(I53=\"\",\"\",(9.4*I53)+(5.7*I54))","v":""},"Mcal"]
[null,null,null,null,null,null,null,"ET (Energia Total)",{"$f":"IF(I55=\"\",\"\",I55/I50)","v":""},"Mcal"]
[null,null,null,null,null,null,null,"ENL Pérdida Peso",{"$f":"IF(I56=\"\",\"\",I56*0.84)","v":""},"Mcal/Kg PVV"]
[null,"OVEJAS SECAS",{"$f":"IF(C51=\"\",\"\",C51+C54+C55)","v":0},"Kcal/día",{"$f":"IF(C58=\"\",\"\",C58/1700)","v":0},null,null,"ENL Ganancia Peso",{"$f":"IF(I56=\"\",\"\",1.066*I56)","v":""},"Mcal/Kg PVV"]
[null,"OVEJAS GESTANTES",{"$f":"IF(C53=\"\",\"\",C51+C53)","v":0},"Kcal/día",{"$f":"IF(C59=\"\",\"\",C59/1700)","v":0},null,null,"Kg perdidos",{"$f":"IF(C45=\"\",\"\",(0.13*C45*C39))","v":""},"KgPV"]
[null,"OVEJAS ORDEÑO",{"$f":"IF(C51=\"\",\"\",C51+C52+C54+C55)","v":0},"Kcal/día",{"$f":"IF(C60=\"\",\"\",C60/1700)","v":0}]
[]
[null,"OVEJAS TOTAL",{"$f":"C51+C52+C53+C54+C55","v":0},null,{"$f":"IF(C62=\"\",\"\",C62/1700)","v":0}]
[]
[]
[]
[]
[]
[]
[]
[]
[]
[]
[]
[]
[]
[]
[]
[]
[]
[]
[]
[]
[]
[]
[]
[]
[]
[]
[]
[]
[]
[]
[]
[]
[]
[]
[]
[]
[]
[]
[]
[]
[]
[]
[]
[]
[]
[]
[]
[]
[]
[]
[]
[]
[]
[]
[]
[]
[]
[]
[]
[]
[]
[]
[]
[]
[]
[]
[]
[]
[]
[]
[]
[]
[]
[]
[]
[null,null,{"$f":"-0.00643*C43","v":0}]
[null,null,{"$f":"EXP(C138)","v":1}]
[null,null,{"$f":"-11.465*C139","v":-11.465}]
[null,null,{"$f":"C140-(0.00643*C43)","v":-11.465}]
[null,null,{"$f":"EXP(C141)","v":1.0490924582726865E-5}]

{"sheet":"PROTEINA ovino","index":5,"n_rows":170,"n_cols":4,"rows_kept":170,"cut":false,"hidden":false,"merged":[]}
[]
[null,"GANADO OVINO",null,"FEDNA 2009"]
[]
[]
["PROTEINA (PDI)"]
[]
[]
[]
[]
[]
[]
[]
[]
[]
[]
[]
[]
[]
[]
[]
[]
[]
[]
[]
[]
[]
[]
[]
[]
[]
[]
[]
[]
[]
[]
[]
[]
[]
[]
[]
[]
[]
[null,"PV",{"$f":"IF('ENLACES DATOS'!G93=\"\",0,'ENLACES DATOS'!G93)","v":0},"Kg"]
[null,"Pc",{"$f":"IF('ENLACES DATOS'!G97=\"\",0,'ENLACES DATOS'!G97)","v":0},"Kg"]
[null,"t",{"$f":"IF('ENLACES DATOS'!G98=\"\",0,'ENLACES DATOS'!G98)","v":0},"dias"]
[null,"PL",{"$f":"IF('ENLACES DATOS'!G94=\"\",0,'ENLACES DATOS'!G94)","v":0},"litros"]
[null,"P",{"$f":"IF('ENLACES DATOS'!G96=\"\",0,('ENLACES DATOS'!G96/10))","v":0},"%"]
[]
[]
[]
[null,"PVmetabólico",{"$f":"IF(C43=\"\",\"\",POWER(C43,0.75))","v":0},"Kg"]
[]
[null,"PDI Mant",{"$f":"IF(C51=\"\",\"\",2.5*C51)","v":0},"gr PDI"]
[null,"PDI Gest",{"$f":"IF(C44=\"\",\"\",((1428.06*C44*C170))/0.7)","v":0},"gr PDI"]
[null,"PDI Lact",{"$f":"IF(C46=\"\",\"\",(10*C46*C47)/0.58)","v":0},"gr PDI"]
[]
[null,"OVEJAS SECAS",{"$f":"IF(C53=\"\",\"\",C53)","v":0},"gr PDI"]
[null,"OVEJAS GESTANTES",{"$f":"IF(C54=\"\",\"\",C53+C54)","v":0},"gr PDI"]
[null,"OVEJAS ORDEÑO",{"$f":"IF(C55=\"\",\"\",C53+C55)","v":0},"gr PDI"]
[null,"OVEJAS TOTAL",{"$f":"C53+C54+C55","v":0}]
[]
[]
[]
[]
[]
[]
[]
[]
[]
[]
[]
[]
[]
[]
[]
[]
[]
[]
[]
[]
[]
[]
[]
[]
[]
[]
[]
[]
[]
[]
[]
[]
[]
[]
[]
[]
[]
[]
[]
[]
[]
[]
[]
[]
[]
[]
[]
[]
[]
[]
[]
[]
[]
[]
[]
[]
[]
[]
[]
[]
[]
[]
[]
[]
[]
[]
[]
[]
[]
[]
[]
[]
[]
[]
[]
[]
[]
[]
[]
[]
[]
[]
[]
[]
[]
[]
[]
[]
[]
[]
[]
[]
[]
[]
[]
[]
[]
[]
[]
[]
[]
[]
[]
[]
[]
[null,null,{"$f":"-0.00601*C45","v":0}]
[null,null,{"$f":"EXP(C166)","v":1}]
[null,null,{"$f":"-11.22*C167","v":-11.22}]
[null,null,{"$f":"C168-(0.00601*C45)","v":-11.22}]
[null,null,{"$f":"EXP(C169)","v":1.3403428842116915E-5}]

{"sheet":"MATERIAS PRIMAS","index":6,"n_rows":113,"n_cols":20,"rows_kept":113,"cut":false,"hidden":false,"merged":[]}
[1,2,3,4,5,6,7,8,9,10,11,12,13,14,15,16,17,18,19,20]
["Descripción resumida","Tipo de ingrediente","MS*","PB*","FB*","GB**","Cenizas*","Almidón am**","Azúcar","FND**","FAD**","LAD**","UFL","UFC","PDIE","PDIN","PDIA","Ca","P","Humedad"]
["Pasto de hierba bueno","Forraje",150,173,200,33,80,null,93,507,207,27,1,0.95,101,113,41,6,3.2,{"$f":"1000-C3","v":850}]
["Pasto de hierba mediano","Forraje",200,140,270,35,75,0,50,510,205,20,0.87,0.8,89,91,35,6.8,2.8,{"$f":"1000-C4","v":800}]
["Hojas de remolacha forrajera","Forraje",120,141.667,116.667,25,166.667,null,100,258.33300000000003,125,16.667000000000002,1.008,1.05,116.667,91.667000000000002,50,12.167,2.5830000000000002,880]
["Maíz verde, lechoso","Forraje",240,83.332999999999998,229.167,25,70.832999999999998,220.833,70.832999999999998,487.5,287.5,25,0.88300000000000001,0.78300000000000003,66.667000000000002,54.167000000000002,20.832999999999998,2.9169999999999998,3,760]
["Maiz verde, pastoso","Forraje",280,85.713999999999999,235.714,21.428999999999998,60.713999999999999,260.714,39.286000000000001,475,278.57100000000003,25,0.90700000000000003,0.81100000000000005,67.856999999999999,53.570999999999998,17.856999999999999,2.5,2.6070000000000002,720]
["Alfalfa pre-floración","Forraje",180,216,231,31,110,0,40,419,330,51,0.745,0.66300000000000003,115,143,61,17.100000000000001,4,820]
["Alfalfa final floración","Forraje",210,169,331,28,91,null,54,530,412,70,0.65500000000000003,0.56100000000000005,96,112,48,9.1,3.1,790]
["Trebol joven","Forraje",118,237.28800000000001,211.864,25.423999999999999,110.169,null,93.22,440.678,220.339,25.423999999999999,1.042,1.0169999999999999,127.119,152.542,33.898000000000003,16.440999999999999,4.2370000000000001,882]
["Trebol maduro","Forraje",130,192.30799999999999,230.76900000000001,30.768999999999998,100,null,69.230999999999995,500,238.46199999999999,23.077000000000002,1,0.96199999999999997,115.38500000000001,123.077,30.768999999999998,12.385,4,870]
["Avena verde, hojas","Forraje",170,170.58799999999999,258.82400000000001,41.176000000000002,88.234999999999999,null,152.941,411.76499999999999,258.82400000000001,17.646999999999998,0.95299999999999996,0.90600000000000003,105.88200000000001,111.765,23.529,3.5880000000000001,4,830]
["Avena verde en flor","Forraje",240,116.667,308.33300000000003,25,87.5,null,150,475,295.83300000000003,20.832999999999998,0.75800000000000001,0.68300000000000005,83.332999999999998,75,16.667000000000002,4.2919999999999998,3.5830000000000002,760]
["Centeno verde","Forraje",170,170.58799999999999,282.35300000000001,35.293999999999997,100,null,117.64700000000001,441.17599999999999,276.471,17.646999999999998,0.871,0.81200000000000006,105.88200000000001,105.88200000000001,23.529,3.4119999999999999,4.2939999999999996,830]
["Colza ","Forraje",140,207.143,164.286,35.713999999999999,142.857,null,78.570999999999998,307.14299999999997,192.857,14.286,1.0429999999999999,1.071,142.857,150,78.570999999999998,19,4.9290000000000003,860]
["Nabo en flor","Forraje",120,191.667,150,33.332999999999998,133.333,null,66.667000000000002,283.33300000000003,183.333,8.3330000000000002,1.0669999999999999,1.1000000000000001,133.333,133.333,75,16.832999999999998,4.5830000000000002,880]
["Ryegrass (pasto ballico)","Forraje",140,200,200,43,93,null,150,414,207,21,1,0.96,105,131,45,5,5,860]
["Ray grass 2 corte","Forraje",160,169,250,38,94,null,150,481,262,25,0.9,0.84,97,110,40,5.8129999999999997,4,840]
["Alcachofa (fresco)","Forraje",112,162,275,15,90,null,66,458,376,113,0.79800000000000004,0.82399999999999995,75,100,23,3.35,3.53,888]
["Silo de hierba 40% MS joven","Forraje",400,180,255,32,93,0,56,483,283,25,0.94,0.89,91,123,37,5.6,2.8,600]
["Silo de hierba 40% MS maduro","Forraje",400,115,335,40,107,null,24,620,370,33,0.78,0.7,69,76,24,8,3.6,600]
["SIlo de trebol rojo ","Forraje",250,164,276,44,104,null,120,478,289,23,0.88,0.81,74,108,26,13.6,2.8,750]
["Silo de alfalfa ","Forraje",250,172,296,40,92,0,28,542,326,127,0.77,0.68,63,108,21,19,2.4,750]
["Silo de hojas de remolacha forrajera","Forraje",150,156,136,29,165,null,20,500,380,40,1.0149999999999999,1.052,120.5,109.3,59.3,20.8,2.4,850]
["Silo de ray grass","Forraje",250,116,288,32,88,null,44,505,317,28,0.9,0.84,69,74,19,6,2.2000000000000002,750]
["Silo de planta entera CENTENO","Forraje",350,90,260,40,75,200,0,515,340,51,0.79,0.72,69,61,22,0.52,2.8,650]
["Silo de planta entera AVENA","Forraje",530,115,270,25,69,200,20,560,340,90,0.77,0.7,73,74,26,7.0000000000000007E-2,0.3,470]
["Slo de maíz 35% MS mucho grano","Forraje",350,76,190,30,44,385,12,377,208,15,1.01,0.97,63,49,17,2.1,2.4,650]
["Silo de maíz 35% MS grano normal","Forraje",350,70,205,30,41,350,17,395,217,15,1,0.96,64,45,16,2.1,2.4,650]
["Silo de planta entera TRITICALE GRANO MEDIO","Forraje",350,110,238,38,65,190,30,523,338,52,0.85,0.78,76,74,26,2.6,3,650]
["Silo de planta entera CEBADA","Forraje",400,96,239,23,75,210,30,480,310,47,0.82,0.75,73,65,23,2.6,3,600]
["Silo de paja de maíz 22.5% MS","Forraje",225,88,315,18,52,10,12,601,366,36,0.74199999999999999,0.59899999999999998,69,54,20,9.8000000000000007,1.7,775]
["Silo de planta entera GUISANTES","Forraje",300,170,200,25,70,170,40,370,268,28,0.89800000000000002,0.92400000000000004,95,109,39,10,3,700]
["Silo de hierba 70% MS (pre-henificado) muy maduro","Forraje",700,92,340,22,66,null,77,673,385,48,0.62,0.52,68,61,26,4,2.6,300]
["Silo de hierba 70% MS (pre-henificado) en flor","Forraje",700,120,304,28,75,null,100,610,340,35,0.81,0.73,86,82,35,4,3.4,300]
["Silo de sorgo","Forraje",360,80,230,29,85,265,10,440,275,30,0.83,0.78700000000000003,69,49,18,4.5,2,640]
["Silo de hierba Sudán","Forraje",400,115,292,37,85,null,32,590,340,36,0.623,0.51400000000000001,61,69,16,6.4,2.7,600]
["Silo de veza","Forraje",450,118,341,22,94,0,48,700,425,84,0.63,0.54,69,79,27,17,4,550]
["Silo de veza-avena","Forraje",450,126,256,24,90,45,30,510,287,45,0.88,0.82,81,83,26,17,4,550]
["Silo de alfalfa, 12.5%PB, maduro","Forraje",400,125,300,27,130,null,24,450,340,64,0.7,0.62,64,83,22,14,3.3,600]
["Silo de alfalfa, PB 16.5%, maduro","Forraje",400,165,325,27,115,null,22,491,380,78,0.68,0.59,70,114,29,16,3.3,600]
["Silo de alfalfa, PB 18.0%, maduro","Forraje",400,180,297,29,113,null,22,456,355,72,0.72,0.63,73,124,32,16,3.3,600]
["Silo de alfalfa, PB 18.0%, medio","Forraje",400,180,282,28,115,null,19,434,330,62,0.76,0.68,76,124,32,16,3.3,600]
["Heno de pasto, PB bajo, medio","Forraje",860,96,317,23,105,null,60,560,335,33,0.8,0.73,80,62,30,4.3,2.5,140]
["Heno de pasto, PB bajo, maduro","Forraje",860,86,350,21,100,null,60,600,360,35,0.75,0.67,75,55,27,3.5,2.5,140]
["Heno trebol rojo + hierba en flor","Forraje",860,100,323,28,95,null,35,615,370,37,0.72299999999999998,0.64500000000000002,70.233000000000004,61.86,26.395,10,2.7,140]
["Heno de alfalfa pre-floración","Forraje",860,164,303,18,106,0,60,520,418,122,0.72,0.63,87,105,41,14.1,3.6,140]
["Pellets de alfalfa ","Forraje",900,192,203,35,112,11,70,397,257,36,0.75700000000000001,0.67900000000000005,108,127,54,10.8,3.8,100]
["Paja de cebada","Forraje",860,38,438,16,60,0,0,730,520,120,0.497,0.51500000000000001,46,23,11,3.8,0.8,140]
["Paja de avena","Forraje",860,38,443,15,78,0,5,700,470,140,0.47799999999999998,0.495,46,23,11,3.3,1.1000000000000001,140]
["Paja de trigo","Forraje",860,37,427,15,80,0,0,730,540,130,0.436,0.34,43,23,11,2.8,0.8,140]
["Paja de cebada tratada con NaOH","Forraje",860,41,382,14,101,0,0,673,455,82,0.58899999999999997,0.51600000000000001,61.628,25,11.86,3.8,0.8,140]
["Paja de maíz","Forraje",913,88,343,9,34,10,54,709,429,44,0.54,0.52500000000000002,91,66,47,6.1,0.9,87]
["Paja de guisantes","Forraje",890,70,420,24,70,30,20,720,380,55,0.64,0.53700000000000003,59,48,21,3.6,1.5,110]
["Heno de alfalfa deshidratada","Forraje",893,209,275,30,110,null,60,473,341,65,0.73,0.66700000000000004,107,137,70,15.6,3.1,107]
["Heno de alfalfa, 17% PB, medio","Forraje",910,173,265,30,92,null,40,484,345,80,0.73,0.63,87,111,43,15.6,3.1,90]
["Heno de alfalfa 16% PB medio","Forraje",900,160,260,30,94,null,35,419,382,90,0.71,0.62,84,102,40,13.7,3,100]
["Heno de alfalfa 14% PB medio","Forraje",900,140,220,30,92,0,35,462,329,70,0.72,0.62,80,88,35,12.2,2.8,100]
["Heno de avena, almidon bajo","Forraje",875,69,286,25,71,32,5,521,364,47,0.68,0.59,65,43,19,3.7,2.2000000000000002,125]
["Heno de avena, almidon alto","Forraje",900,56,278,25,61,117,5,611,333,57,0.74,0.66,65,35,15,3.7,2.2000000000000002,100]
["Heno de veza","Forraje",913,82,303,22,79,0,76,617,352,74,0.72,0.64,76,54,27,17,4,87]
["Heno de veza-avena","Forraje",880,126,256,24,90,45,30,510,287,45,0.81,0.74,84,80,31,17,4,120]
["Heno de veza-avena","Forraje",910,118,341,24,90,35,30,700,425,84,0.6,0.5,70,75,29,17,4,90]
["Agua","Ingrediente (húmedo)",0,null,null,null,null,null,null,null,null,null,null,null,null,null,null,null,null,1000]
["Grasa de leche fresca","Ingrediente (húmedo)",80,400,0,50,100,0,462.5,0,null,null,1.35,1.3959999999999999,75,230,null,11.25,8.75,920]
["Levadura de cerveza 25% MS","Ingrediente (húmedo)",250,496,40,22,80,40,20,35,7,null,1.1679999999999999,1.153,146.80000000000001,318.8,83.6,3,17.2,750]
["Grano fresco de cerveceria","Ingrediente (húmedo)",230,249,185,80,55,42,8,555,197,36,0.90300000000000002,0.82499999999999996,163.04300000000001,184.34800000000001,130,3.8,6.8,770]
["Silo de grano de cerveceria","Ingrediente (húmedo)",260,246,200,88,62,46,12,555,197,36,0.90700000000000003,0.82799999999999996,160.76900000000001,181.923,128.46199999999999,3.5,5.8,{"$f":"1000-C68","v":740}]
["Patata fresca","Ingrediente (húmedo)",220,95,28,7,73,690,40,85,28,11,1.0780000000000001,1.1279999999999999,96.817999999999998,63.182000000000002,23.635999999999999,0.55900000000000005,2.7320000000000002,780]
["Silo de patata ","Ingrediente (húmedo)",220,100,34,5,76,690,42,96,34,13,1.0549999999999999,1.1040000000000001,97.272999999999996,66.817999999999998,25,0.55900000000000005,2.7320000000000002,780]
["Pulpa de patata","Ingrediente (húmedo)",180,50,208,6,33,387,0,349,284,27,1.167,1.1779999999999999,93.332999999999998,33.889000000000003,20.556000000000001,3.3,2.778,820]
["Grano humedo de destileria","Ingrediente (húmedo)",70,284,93,116,50,81,29,240,69,12,0.999,0.92900000000000005,162.857,208.571,124.286,2.5710000000000002,8.5709999999999997,930]
["Remolacha azucarera","Ingrediente (húmedo)",240,67,54,6,83,null,667,129,79,10,0.92600000000000005,0.90500000000000003,70,38.75,null,2.0790000000000002,1.671,760]
["Remolacha forrajera","Ingrediente (húmedo)",176,68.010999999999996,63.011000000000003,6.0229999999999997,85,null,681.02300000000002,145,86.989000000000004,10,0.92400000000000004,0.90300000000000002,69.885999999999996,39.204999999999998,null,1.6990000000000001,3.4089999999999998,824]
["Col","Ingrediente (húmedo)",110,109,91,9,73,null,636,162,96,12,1.165,1.216,120,79.090999999999994,43.636000000000003,4.5549999999999997,3.1819999999999999,890]
["Pulpa de remolacha humeda","Ingrediente (húmedo)",127,118.03100000000001,235.98400000000001,24.015999999999998,78.975999999999999,null,31.969000000000001,588.03099999999995,288.03100000000001,11.023999999999999,0.99399999999999999,0.96899999999999997,108.661,82.677000000000007,44.881999999999998,10.196999999999999,1.5669999999999999,873]
["Pulpa de remolacha prensada","Ingrediente (húmedo)",200,115,205,12,60,null,17,496,243,10,1,0.97499999999999998,110.5,80,43.5,10,1.5,800]
["Pulpa de citríco fresca","Ingrediente (húmedo)",220,68,132,28,64,2,250,228,217,33,1.159,1.2110000000000001,96,45,23,14.6,1.1000000000000001,780]
["NANTADIET 50 (NG)","Pienso NANTA",890.68899999999996,355.88200000000001,90.906999999999996,22.454999999999998,119.449,77.885000000000005,77.149000000000001,260.66199999999998,116.572,22.579000000000001,0.97,0.93200000000000005,171.18299999999999,247,119.477,16.841000000000001,7.859,109.31100000000004]
["OVILAC INTEGRAL N2500 (NG)","Pienso NANTA",891.89,205.24799999999999,118.849,41.484999999999999,83.364000000000004,189.96700000000001,64.894999999999996,239.321,109.572,12.826000000000001,1.0649999999999999,1.0369999999999999,132.303,142.80600000000001,64.537000000000006,9.8070000000000004,5.0060000000000002,108.11000000000001]
["AMALTEA L2500 (NG)","Pienso NANTA",897.79200000000003,183.78399999999999,89.106999999999999,44.554000000000002,86.518000000000001,278.46100000000001,47.317,242.33099999999999,108.953,19.611999999999998,1.075,1.056,117.602,126.208,60.338999999999999,7.24,5.9029999999999996,102.20799999999997]
["CAPRI COMPLET (NV)","Pienso NANTA",899.01800000000003,189.095,133.47900000000001,37.390999999999998,83.515000000000001,211.571,51.765999999999998,272.93200000000002,161.768,35.965000000000003,1.0229999999999999,0.99299999999999999,112.63500000000001,126.03700000000001,55.616,7.67,5.0199999999999996,100.98199999999997]
["INOGEST ST ","Pienso NANTA",893.66800000000001,160.98400000000001,79.456999999999994,32.012999999999998,75.126000000000005,365.30799999999999,52.58,230.06299999999999,98.772999999999996,21.68,1.024,1.0009999999999999,109.66,109.66,49.661000000000001,13.428000000000001,5.0350000000000001,106.33199999999999]
["INOLAC  EQ ","Pienso NANTA",893.30399999999997,222.995,87.245000000000005,59.801000000000002,76.691999999999993,231.834,67.53,308.75700000000001,120.029,27.8,1.038,1.0049999999999999,125.377,148.28800000000001,58.198,10.074999999999999,6.258,106.69600000000003]
["INOLAC ","Pienso NANTA",889.952,191.02199999999999,111.395,36.979999999999997,82.230999999999995,247.20400000000001,50.155999999999999,341.24,145.05000000000001,32.512999999999998,0.97799999999999998,0.94,112.366,127.30800000000001,53.133000000000003,10.113,6.8529999999999998,110.048]
["OVINOLAC TOP ","Pienso NANTA",900.34199999999998,247.441,73.11,38.874000000000002,78.356999999999999,275.45699999999999,62.137,218.90899999999999,95.9,22.638000000000002,1.0660000000000001,1.042,136.99600000000001,166.666,71.131,9.9960000000000004,6.4039999999999999,99.658000000000015]
["024B OVINANTA 90 ","Pienso NANTA",891.37,190.71799999999999,132.38300000000001,30.044,101.32,188.08500000000001,46.904000000000003,478.83600000000001,188.10900000000001,46.482999999999997,0.83699999999999997,0.78,90.894999999999996,123.81699999999999,41.093000000000004,16.827999999999999,7.649,108.63]
["OVIRECRIA ","Pienso NANTA",895.09900000000005,184.33699999999999,79.162999999999997,31.632999999999999,68.617000000000004,377.98700000000002,34.911999999999999,189.99299999999999,92.141999999999996,21.335999999999999,1.0409999999999999,1.0169999999999999,113.84399999999999,124.142,51.930999999999997,11.172000000000001,5.4480000000000004,104.90099999999995]
["CAPRIRECRIA","Pienso NANTA",895.09900000000005,184.33699999999999,79.162999999999997,31.632999999999999,68.617000000000004,377.98700000000002,34.911999999999999,189.99299999999999,92.141999999999996,21.335999999999999,1.0409999999999999,1.0169999999999999,113.84399999999999,124.142,51.930999999999997,11.172000000000001,5.4480000000000004,104.90099999999995]
["1596GGR.OVINANTA SUPER ","Pienso NANTA",893.17100000000005,223.92099999999999,114.965,29.355,92.379000000000005,214.036,43.966999999999999,362.84,153.374,38.542999999999999,0.90900000000000003,0.86199999999999999,111.961,148.50700000000001,59.411000000000001,13.722,7.8150000000000004,106.82899999999995]
["1595GGR.OVICARN ","Pienso NANTA",904.14300000000003,165.90299999999999,158.46299999999999,27.65,135.90799999999999,187.79300000000001,36.863999999999997,418.68099999999998,208.417,52.177,0.755,0.69399999999999995,82.950999999999993,106.455,33.554000000000002,24.332000000000001,5.952,95.856999999999971]
["Jabón cálcico (Megalac)","Ingrediente (seco)",970,0,0,871.13400000000001,128.86600000000001,0,0,0,null,null,3.4020000000000001,3.7010000000000001,null,null,null,92.784000000000006,0,30]
["Propilenglycol","Ingrediente (seco)",998,null,null,331.66300000000001,null,null,null,null,null,null,2.1040000000000001,2.4350000000000001,14.028,null,null,null,null,2]
["Semilla de algodón entera","Ingrediente (seco)",911,227.22300000000001,259.05599999999998,210.75700000000001,43.908000000000001,null,31.832999999999998,479.69299999999998,285.40100000000001,130.626,1.0349999999999999,0.93400000000000005,83.424999999999997,140.505,51.591999999999999,1.5369999999999999,7.4640000000000004,89]
["Aceite de palm","Ingrediente (seco)",995,0,0,1000,0,0,0,0,null,null,3.1930000000000001,3.3660000000000001,null,null,null,null,0,5]
["Aceite de soya","Ingrediente (seco)",995,0,0,1000,0,0,0,0,null,null,3.1960000000000002,3.266,null,null,null,null,0,5]
["Avena ","Ingrediente (seco)",889,134.983,118.11,55.118000000000002,29.245999999999999,431.94600000000003,14.622999999999999,264.34199999999998,133.858,26.997,0.92800000000000005,0.86499999999999999,92.238,92.238,39.369999999999997,1.125,3.375,111]
["Cebada ","Ingrediente (seco)",871,126.292,57.405000000000001,21.814,26.405999999999999,572.90499999999997,26.405999999999999,168.77199999999999,63.146000000000001,14.925000000000001,1.071,1.0489999999999999,102.181,86.108000000000004,36.738999999999997,0.68899999999999995,4.0179999999999998,129]
["Cebada machacada","Ingrediente (seco)",871,118.255,52.813000000000002,19.518000000000001,24.11,568.31200000000001,28.702999999999999,168.77199999999999,63.146000000000001,14.925000000000001,1.0840000000000001,1.0649999999999999,101.033,80.367000000000004,34.442999999999998,0.68899999999999995,4.0179999999999998,129]
["Centeno 12% PB","Ingrediente (seco)",872,137.61500000000001,24.082999999999998,14.907999999999999,18.349,598.62400000000002,74.540999999999997,112.38500000000001,32.11,9.1739999999999995,1.171,1.173,103.211,89.45,30.963000000000001,0.45900000000000002,3.67,128]
["Maíz","Ingrediente (seco)",872,103.211,26.376000000000001,49.311999999999998,14.907999999999999,700.68799999999999,14.907999999999999,118.119,30.963000000000001,3.44,1.2190000000000001,1.2250000000000001,100.917,80.275000000000006,58.485999999999997,0.22900000000000001,3.0960000000000001,128]
["Pulpa de citrico","Ingrediente (seco)",900,68.888999999999996,138.88900000000001,27.777999999999999,72.221999999999994,15.555999999999999,224.44399999999999,215.55600000000001,151.11099999999999,12.222,1.081,1.0740000000000001,94.444000000000003,48.889000000000003,24.443999999999999,16.332999999999998,1.111,100]
["Pulpa de manzana","Ingrediente (seco)",880,79.545000000000002,295.45499999999998,25,45.454999999999998,0,187.5,579.54499999999996,469.31799999999998,182.95500000000001,0.61,0.50600000000000001,60.226999999999997,51.136000000000003,17.045000000000002,0.68200000000000005,0.79500000000000004,120]
["Pulpa de remolacha 12% Azucar","Ingrediente (seco)",904,98.450999999999993,186.947,9.9559999999999995,71.903000000000006,5.5309999999999997,129.42500000000001,404.86700000000002,216.81399999999999,12.167999999999999,0.98199999999999998,0.96,116.15,79.646000000000001,49.779000000000003,8.2959999999999994,0.996,96]
["Pulpa de remolacha 19 % Azucar","Ingrediente (seco)",914,112.691,148.79599999999999,7.6589999999999998,86.433000000000007,5.47,203.501,322.75700000000001,172.86699999999999,9.8469999999999995,0.98199999999999998,0.96499999999999997,119.256,85.338999999999999,53.610999999999997,8.9719999999999995,0.65600000000000003,86]
["Torta de soja 44% PB","Ingrediente (seco)",876,502.28300000000002,69.635000000000005,27.396999999999998,73.058999999999997,6.8490000000000002,106.164,162.1,101.598,4.5659999999999998,1.2030000000000001,1.1930000000000001,254.566,366.43799999999999,196.34700000000001,2.968,7.42,124]
["Trigo ","Ingrediente (seco)",868,115.20699999999999,28.802,18.433,17.280999999999999,661.29,31.106000000000002,116.35899999999999,34.561999999999998,8.0649999999999995,1.1579999999999999,1.159,100.23,77.188999999999993,28.802,0.46100000000000002,3.5710000000000002,132]
["Triticale 11% PB","Ingrediente (seco)",876,127.854,25.114000000000001,17.123000000000001,19.405999999999999,647.26,45.661999999999999,111.872,30.821999999999999,10.273999999999999,1.167,1.17,99.314999999999998,83.332999999999998,26.256,0.34200000000000003,3.7669999999999999,124]
["Pipa de girasol (entera)","Ingrediente (seco)",914,153.173,311.81599999999997,318.38099999999997,29.54,28.446000000000002,36.104999999999997,458.42500000000001,344.63900000000001,99.561999999999998,0.86399999999999999,0.72299999999999998,29.54,92.998000000000005,15.317,1.7509999999999999,4.7050000000000001,86]
["Habas","Ingrediente (seco)",863,290.846,91.540999999999997,23.175000000000001,39.396999999999998,378.911,32.445,171.495,115.875,8.1110000000000007,1.1910000000000001,1.1919999999999999,111.24,185.4,52.143999999999998,1.159,6.0250000000000004,137]
["Carbonato cálcico 32% Ca","Minero-Vitaminico",970,null,null,null,979.38099999999997,0,0,null,null,null,null,null,null,null,null,329.89699999999999,null,30]
["Cloruro de sodio (sal común)","Minero-Vitaminico",970,null,null,null,994.84500000000003,null,null,null,null,null,null,null,null,null,null,null,null,30]
["Leche Oveja","Leche",180,326,0,388,25,0,233,0,0,0,1.55,1.47,40,184,17,11.9,8.8000000000000007,820]

{"sheet":"FUENTE DATOS Y ECUACIONES","index":7,"n_rows":69,"n_cols":11,"rows_kept":69,"cut":false,"hidden":false,"merged":[[25,3,25,4],[25,5,25,10],[9,3,9,4],[9,5,9,6],[9,7,9,8],[56,0,57,0],[59,0,60,0],[3,4,3,5],[6,1,7,2],[6,3,6,4],[6,5,6,8],[7,3,7,4],[7,5,7,6],[7,7,7,8],[22,1,23,2],[22,3,22,4],[22,5,22,10],[23,3,23,4],[23,5,23,6],[23,7,23,8],[23,9,23,10]]}
[]
[]
[]
[]
[]
[]
[null,"RACIONES",null,"CAPRINO",null,"OVINO"]
[null,null,null,"LECHE",null,"CARNE",null,"LECHE"]
[null,"NUTRIENTE","UNIDADES","MEDIA","DESVST","MEDIA","DESVST","MEDIA","DESVST"]
[null,"N","numero",71,null,18,null,91]
[null,"N_CHO_RD/kg MS","gramos",149.583098591549,27.723790639167898,118.888888888889,34.142553901665003,140.37582417582399,25.7620450389899]
[null,"RUMIA IDX/kg MS","indice",143.54084507042299,31.261037262128699,184.694444444444,33.257099590953601,148.773626373626,22.221095258359799]
[null,"ACID INDEX/kg MS","indice",33.707042253521102,4.8688609387663604,27.205555555555598,7.7497986480273804,31.968131868131898,5.2249801513899099]
[null,"N_CET/kg MS","gramos",163.85492957746499,13.1004993223527,146.46666666666701,21.173623991683002,155.223076923077,16.838732315198399]
[null,"N_GLU/kg MS","gramos",140.77887323943699,16.650670647093801,109.555555555556,19.560741662296099,134.542857142857,23.143994387107899]
[null,"N-END/Kg MS","indice",844.76056338028195,78.494852386042695,696.77777777777806,109.561991882949,796.02197802197804,103.504694259834]
[null,"N-BPD/Kg MS","gramos",22.9830985915493,13.4042102758317,22.3888888888889,11.856489356857701,22.457142857142902,11.7346319627668]
[]
[]
[]
[]
[]
[null,"PIENSOS",null,"CARNE",null,"LECHE"]
[null,null,null,"CEBO",null,"ORDEÑO",null,"PREPARTO",null,"RECRIA"]
[null,"NUTRIENTE","UNIDADES","MEDIA","DESVST","MEDIA","DESVST","MEDIA","DESVST","MEDIA","DESVST"]
[null,"N","numero",19,null,19]
[null,"N_CHO_RD","gramos",236.82105263157899,19.428775307299698,174.361538461538,18.982515571859999,201.73333333333301,13.4537479288605,195.333333333333,3.9399661589074202]
[null,"RUMIA IDX","indice",31.768421052631599,4.8138749270068804,49.984615384615402,7.6300771243204197,40.200000000000003,0.43588989435430398,45.1,5.2306787322487498]
[null,"ACID INDEX","indice",46.405263157894701,4.6651752002602702,35.846153846153797,5.7952013747892304,42.233333333333299,3.7634204300520202,41.7,1.50996688705417]
[null,"N_CET","gramos",173.63684210526301,8.32427577939713,171.592307692308,6.3882002601760099,161.30000000000001,3.9661064030104898,166.8,1.90787840283247]
[null,"N_GLU","gramos",208.81052631578899,7.5281615534137503,160.79230769230799,17.917285022126201,195.166666666667,13.603430939778599,183.166666666667,18.265906310208901]
[null,"N-END","indice",1050.6315789473699,46.533393656020799,947.92307692307702,41.495906501849802,955.66666666666697,26.633312473917599,953.33333333333303,21.594752448994001]
[null,"N-BPD","gramos",10.5526315789474,11.363849524848201,36.5,6.43700240795354,10.7,8.7709748602991695,23.466666666666701,0.30550504633074699]
[]
[]
[]
[]
[null,"RACIONES","CONSTANTE","UF/kg MS","PB/kg MS","GB/kg MS","FB/kg MS","Alm+Su/kg MS","Almidón/kg MS","R"]
[null,"N_CHO_RD/kg MS",null,254,-0.41916922539584273,null,null,6.4766284092565143E-2,null,0.99299999999999999]
[null,"RUMIA IDX/kg MS",-310.15309737923968,249.8572116244363,null,null,1.1767646813930281,null,null,0.91600000000000004]
[null,"ACID INDEX/kg MS",null,39,null,null,null,2.1806213440280938E-2,null,0.99399999999999999]
[null,"N_CET/kg MS",null,153.19856735640295,null,0.78232751273610768,null,null,null,0.996]
[null,"N_GLU/kg MS",null,116.99551354201542,null,null,null,null,0.23698189395059838,0.99299999999999999]
[null,"N_END",null,757.04025742290366,null,3.15,null,null,0.35,0.999]
[null,"N-BPD",-103.92054069209392,null,0.60412839902576043,null,0.1640278555843033,null,null,0.69699999999999995]
[]
[]
[null,"PIENSOS","CONSTANTE","UF","PB","GB","FB","Cenizas","Almidon","R"]
[null,"N_CHO_RD",86.815160934558392,null,null,null,null,null,0.38798137310513114,0.86099999999999999]
[null,"RUMIA IDX",43.852766922499875,-29.279166038108606,null,null,0.29277909311429606,null,null,0.96799999999999997]
[null,"ACID INDEX",19.458261279796815,null,null,null,null,null,7.1913114316706203E-2,0.83399999999999996]
[null,"N_CET",173.70005882923363,-8.754753546860309,null,0.6861676203417294,null,-0.29703187111478324,null,0.77200000000000002]
[null,"N_GLU",null,130.74022882443342,null,null,null,null,0.22630611749847071,0.999]
[null,"N-END",118.62747671387649,927.82122090373878,null,null,null,null,null,0.89400000000000002]
[null,"N-BPD",-113.02118889985687,null,0.70261590108969696,null,0.23512558653136462,null,null,0.86399999999999999]
[]
["RACIONES","UFL",1.3933114682383763,null,-4.3373432763116657E-4,1.3696275318449765E-3,-2.2204278549997026E-3,null,-3.7363609981822183E-4,0.90300000000000002]
[null,"UFC",1.4633759884725352,null,-6.6740731976705492E-4,1.5306998925034253E-3,-2.6493592532803815E-3,null,-4.3921805635956177E-4,0.90200000000000002]
[]
["PIENSOS","UFL",1.1030009648889367,null,-5.4524210878347799E-5,2.3372993068199186E-3,-1.6547852615987487E-3,-1.6099657298786197E-3,null,0.95799999999999996]
[null,"UFC",1.1304289505718159,null,-1.6358340456770941E-4,2.3478591927341475E-3,-2.0515095965571812E-3,-1.6086952966682814E-3,null,0.95599999999999996]
[]
[]
[]
[null,"NECESIDADES","VALOR","F(x)"]
[null,"Ca",6.5,"IMS"]
[null,"P",3.5,"IMS"]
[null,"FND",13,"PV"]
[null,"GB (Max)",70,"IMS"]

{"sheet":"ENLACES DATOS","index":8,"n_rows":190,"n_cols":23,"rows_kept":190,"cut":false,"hidden":false,"merged":[]}
[null,null,null,null,null,null,null,null,null,"RANGO CONFIANZA",null,null,null,null,null,null,"UTILIDAD","VALOR","REFERENCIA","LIMITE MINIMO","LIMITE MAXIMO","R","% VARIABILIDAD"]
[null,null,null,null,null,null,null,null,null,{"$f":"IF(RACIONES!C12=\"\",1,RACIONES!C12)","v":1},null,null,{"$f":"IF(RACIONES!$C$10=\"\",\"\",RACIONES!$C$10)","v":""},{"$f":"IF(RACIONES!$C$11=\"\",\"\",RACIONES!$C$11)","v":""},"N_CHO_RD/kg MS",{"$f":"CONCATENATE(M2,N2,O2)","v":"N_CHO_RD/kg MS"},{"$f":"IF($F3=\"\",\"\",VLOOKUP($P2,$D$14:$K$34,Q$9,FALSE))","v":""},{"$f":"IF($F3=\"\",\"\",VLOOKUP($P2,$D$14:$K$34,R$9,FALSE))","v":""},"","","","",""]
[null,null,"UF/kg MS",{"$f":"F3","v":""},null,{"$f":"IF(RACIONES!G7=\"\",\"\",RACIONES!G7)","v":""},{"$f":"H3/$I$3","v":{"$error":"#VALUE!"}},{"$f":"IF(RACIONES!H7=\"\",\"\",RACIONES!H7)","v":""},{"$f":"IF(RACIONES!I7=\"\",\"\",RACIONES!I7)","v":""},null,null,null,{"$f":"IF(RACIONES!$C$10=\"\",\"\",RACIONES!$C$10)","v":""},{"$f":"IF(RACIONES!$C$11=\"\",\"\",RACIONES!$C$11)","v":""},"RUMIA IDX/kg MS","RUMIA IDX/kg MS",{"$f":"IF($F4=\"\",\"\",VLOOKUP($P3,$D$14:$K$34,Q$9,FALSE))","v":""},{"$f":"IF($F4=\"\",\"\",VLOOKUP($P3,$D$14:$K$34,R$9,FALSE))","v":""},{"$f":"IF($F4=\"\",\"\",VLOOKUP($P3,$D$14:$K$34,S$9,FALSE))","v":""},"","","",""]
[null,null,"PB/kg MS",{"$f":"F4*1000","v":{"$error":"#VALUE!"}},null,{"$f":"IF(RACIONES!G8=\"\",\"\",RACIONES!G8)","v":""},{"$error":"#VALUE!"},{"$f":"IF(RACIONES!H8=\"\",\"\",RACIONES!H8)","v":""},null,null,null,null,{"$f":"IF(RACIONES!$C$10=\"\",\"\",RACIONES!$C$10)","v":""},{"$f":"IF(RACIONES!$C$11=\"\",\"\",RACIONES!$C$11)","v":""},"ACID INDEX/kg MS","ACID INDEX/kg MS","","","","","","",""]
[null,null,"GB/kg MS",{"$f":"F5*1000","v":{"$error":"#VALUE!"}},null,{"$f":"IF(RACIONES!G9=\"\",\"\",RACIONES!G9)","v":""},{"$error":"#VALUE!"},{"$f":"IF(RACIONES!H9=\"\",\"\",RACIONES!H9)","v":""},"UFL",{"$f":"IF(F4=\"\",\"\",'FUENTE DATOS Y ECUACIONES'!C57+('FUENTE DATOS Y ECUACIONES'!E57*'ENLACES DATOS'!D4)+('ENLACES DATOS'!D5*'FUENTE DATOS Y ECUACIONES'!F57)+('FUENTE DATOS Y ECUACIONES'!G57*'ENLACES DATOS'!D6)+('ENLACES DATOS'!D7*'FUENTE DATOS Y ECUACIONES'!I57))","v":""},null,null,{"$f":"IF(RACIONES!$C$10=\"\",\"\",RACIONES!$C$10)","v":""},{"$f":"IF(RACIONES!$C$11=\"\",\"\",RACIONES!$C$11)","v":""},"N_CET/kg MS","N_CET/kg MS","","","","","","",""]
[null,null,"FB/kg MS",{"$f":"F6*1000","v":{"$error":"#VALUE!"}},null,{"$f":"IF(RACIONES!G10=\"\",\"\",RACIONES!G10)","v":""},{"$error":"#VALUE!"},{"$f":"IF(RACIONES!H10=\"\",\"\",RACIONES!H10)","v":""},"UFV",{"$f":"IF(F4=\"\",\"\",'FUENTE DATOS Y ECUACIONES'!C58+('FUENTE DATOS Y ECUACIONES'!E58*'ENLACES DATOS'!D4)+('ENLACES DATOS'!D5*'FUENTE DATOS Y ECUACIONES'!F58)+('FUENTE DATOS Y ECUACIONES'!G58*'ENLACES DATOS'!D6)+('ENLACES DATOS'!D7*'FUENTE DATOS Y ECUACIONES'!I58))","v":""},null,null,{"$f":"IF(RACIONES!$C$10=\"\",\"\",RACIONES!$C$10)","v":""},{"$f":"IF(RACIONES!$C$11=\"\",\"\",RACIONES!$C$11)","v":""},"N_GLU/kg MS","N_GLU/kg MS","","","","","","",""]
[null,null,"Almidón/kg MS",{"$f":"F7*1000","v":{"$error":"#VALUE!"}},null,{"$f":"IF(RACIONES!G11=\"\",\"\",RACIONES!G11)","v":""},{"$error":"#VALUE!"},{"$f":"IF(RACIONES!H11=\"\",\"\",RACIONES!H11)","v":""},"UF",{"$f":"IF(J5=\"\",\"\",(J5*0.65)+(J6*0.35))","v":""},null,null,{"$f":"IF(RACIONES!$C$10=\"\",\"\",RACIONES!$C$10)","v":""},{"$f":"IF(RACIONES!$C$11=\"\",\"\",RACIONES!$C$11)","v":""},"N-END/Kg MS","N-END/Kg MS","","","","","","",""]
[null,null,"Azucar/Kg MS",{"$f":"F8*1000","v":{"$error":"#VALUE!"}},null,{"$f":"IF(RACIONES!G12=\"\",\"\",RACIONES!G12)","v":""},{"$error":"#VALUE!"},{"$f":"IF(RACIONES!H12=\"\",\"\",RACIONES!H12)","v":""},null,null,null,null,{"$f":"IF(RACIONES!$C$10=\"\",\"\",RACIONES!$C$10)","v":""},{"$f":"IF(RACIONES!$C$11=\"\",\"\",RACIONES!$C$11)","v":""},"N-BPD/Kg MS","N-BPD/Kg MS",{"$f":"IF($F8=\"\",\"\",VLOOKUP($P8,$D$14:$K$34,Q$9,FALSE))","v":""},"","","","","",""]
[null,null,"Alm+Su/kg MS",{"$f":"D7+D8","v":{"$error":"#VALUE!"}},null,0.10061902998696216,null,null,null,null,null,null,null,null,null,1,8,2,3,4,5,6,7]
[]
[]
[null,null,null,null,null,null,null,null,null,null,null,null,{"$f":"IF(RACIONES!$C$10=\"\",\"\",RACIONES!$C$10)","v":""},{"$f":"IF(RACIONES!$C$11=\"\",\"\",RACIONES!$C$11)","v":""},{"$f":"IF(RACIONES!I25=\"\",\"\",RACIONES!I25)","v":""},{"$f":"CONCATENATE(M12,N12,O12)","v":""},{"$f":"IF($O12=\"\",\"\",VLOOKUP($P12,$D$14:$K$34,Q$9,FALSE))","v":""},{"$f":"IF($O12=\"\",\"\",VLOOKUP($P12,$D$14:$K$34,R$9,FALSE))","v":""},{"$f":"IF($O12=\"\",\"\",VLOOKUP($P12,$D$14:$K$34,S$9,FALSE))","v":""},{"$f":"IF($O12=\"\",\"\",VLOOKUP($P12,$D$14:$K$34,T$9,FALSE))","v":""},{"$f":"IF($O12=\"\",\"\",VLOOKUP($P12,$D$14:$K$34,U$9,FALSE))","v":""}]
["RACIONES",null,null,null,"VALOR","REFERENCIA","LIMITE MINIMO","LIMITE MAXIMO","R","% VARIABILIDAD","UTILIDAD"]
["CAPRINO","LECHE","N_CHO_RD/kg MS",{"$f":"CONCATENATE(A14,B14,C14)","v":"CAPRINOLECHEN_CHO_RD/kg MS"},{"$f":"('FUENTE DATOS Y ECUACIONES'!$D$39*'ENLACES DATOS'!$D$3)+('ENLACES DATOS'!$D$4*'FUENTE DATOS Y ECUACIONES'!$E$39)+('FUENTE DATOS Y ECUACIONES'!$H$39*'ENLACES DATOS'!$D$9)","v":{"$error":"#VALUE!"}},149.583098591549,{"$f":"F14-('FUENTE DATOS Y ECUACIONES'!E11*'ENLACES DATOS'!$J$2)","v":121.8593079523811},{"$f":"F14+('FUENTE DATOS Y ECUACIONES'!E11*'ENLACES DATOS'!$J$2)","v":177.30688923071691},0.99299999999999999,{"$f":"(E14-F14)/F14","v":{"$error":"#VALUE!"}},"Incrementar producción"]
["CAPRINO","LECHE","RUMIA IDX/kg MS","CAPRINOLECHERUMIA IDX/kg MS",{"$f":"('FUENTE DATOS Y ECUACIONES'!$C$40+('FUENTE DATOS Y ECUACIONES'!$D$40*'ENLACES DATOS'!$D$3)+('ENLACES DATOS'!$D$6*'FUENTE DATOS Y ECUACIONES'!$G$40))","v":{"$error":"#VALUE!"}},143.54084507042299,{"$f":"F15-('FUENTE DATOS Y ECUACIONES'!E12*'ENLACES DATOS'!$J$2)","v":112.27980780829429},{"$f":"F15+('FUENTE DATOS Y ECUACIONES'!E12*'ENLACES DATOS'!$J$2)","v":174.80188233255168},0.91600000000000004,{"$f":"(E15-F15)/F15","v":{"$error":"#VALUE!"}},"Funcionamiento de la rumia"]
["CAPRINO","LECHE","ACID INDEX/kg MS","CAPRINOLECHEACID INDEX/kg MS",{"$f":"('FUENTE DATOS Y ECUACIONES'!$D$41*'ENLACES DATOS'!$D$3)+'FUENTE DATOS Y ECUACIONES'!$H$41*'ENLACES DATOS'!$D$9","v":{"$error":"#VALUE!"}},33.707042253521102,{"$f":"F16-('FUENTE DATOS Y ECUACIONES'!E13*'ENLACES DATOS'!$J$2)","v":28.838181314754742},{"$f":"F16+('FUENTE DATOS Y ECUACIONES'!E13*'ENLACES DATOS'!$J$2)","v":38.575903192287463},0.99399999999999999,{"$error":"#VALUE!"},"Evitar acidosis"]
["CAPRINO","LECHE","N_CET/kg MS","CAPRINOLECHEN_CET/kg MS",{"$f":"($D$3*'FUENTE DATOS Y ECUACIONES'!$D$42)+('FUENTE DATOS Y ECUACIONES'!$F$42*'ENLACES DATOS'!$D$5)","v":{"$error":"#VALUE!"}},163.85492957746499,{"$f":"F17-('FUENTE DATOS Y ECUACIONES'!E14*'ENLACES DATOS'!$J$2)","v":150.75443025511228},{"$f":"F17+('FUENTE DATOS Y ECUACIONES'!E14*'ENLACES DATOS'!$J$2)","v":176.95542889981769},0.996,{"$error":"#VALUE!"},"Incremento de grasa en leche"]
["CAPRINO","LECHE","N_GLU/kg MS","CAPRINOLECHEN_GLU/kg MS",{"$f":"('FUENTE DATOS Y ECUACIONES'!$D$43*'ENLACES DATOS'!$D$3)+('ENLACES DATOS'!$D$7*'FUENTE DATOS Y ECUACIONES'!$I$43)","v":{"$error":"#VALUE!"}},140.77887323943699,{"$f":"F18-('FUENTE DATOS Y ECUACIONES'!E15*'ENLACES DATOS'!$J$2)","v":124.12820259234319},{"$f":"F18+('FUENTE DATOS Y ECUACIONES'!E15*'ENLACES DATOS'!$J$2)","v":157.42954388653078},0.99299999999999999,{"$error":"#VALUE!"},"Evitar toxemias de gestación"]
["CAPRINO","LECHE","N-END/Kg MS","CAPRINOLECHEN-END/Kg MS",{"$f":"('FUENTE DATOS Y ECUACIONES'!$D$44*'ENLACES DATOS'!$D$3)+('FUENTE DATOS Y ECUACIONES'!$I$44*'ENLACES DATOS'!$D$7)+($D$5*'FUENTE DATOS Y ECUACIONES'!$F$44)","v":{"$error":"#VALUE!"}},844.76056338028195,{"$f":"F19-('FUENTE DATOS Y ECUACIONES'!E16*'ENLACES DATOS'!$J$2)","v":766.26571099423927},{"$f":"F19+('FUENTE DATOS Y ECUACIONES'!E16*'ENLACES DATOS'!$J$2)","v":923.25541576632463},0.999,{"$error":"#VALUE!"},"Energía dinámica"]
["CAPRINO","LECHE","N-BPD/Kg MS","CAPRINOLECHEN-BPD/Kg MS",{"$f":"('FUENTE DATOS Y ECUACIONES'!$C$45+('FUENTE DATOS Y ECUACIONES'!$E$45*'ENLACES DATOS'!$D$4)+('FUENTE DATOS Y ECUACIONES'!$G$45*'ENLACES DATOS'!$D$6))","v":{"$error":"#VALUE!"}},22.9830985915493,{"$f":"F20-('FUENTE DATOS Y ECUACIONES'!E17*'ENLACES DATOS'!$J$2)","v":9.5788883157176006},{"$f":"F20+('FUENTE DATOS Y ECUACIONES'!E17*'ENLACES DATOS'!$J$2)","v":36.387308867381002},0.69699999999999995,{"$error":"#VALUE!"},"Balance Energía-Proteína"]
["OVINO","CARNE","N_CHO_RD/kg MS","OVINOCARNEN_CHO_RD/kg MS",{"$f":"('FUENTE DATOS Y ECUACIONES'!$D$39*'ENLACES DATOS'!$D$3)+('ENLACES DATOS'!$D$4*'FUENTE DATOS Y ECUACIONES'!$E$39)+('FUENTE DATOS Y ECUACIONES'!$H$39*'ENLACES DATOS'!$D$9)","v":{"$error":"#VALUE!"}},118.888888888889,{"$f":"F21-('FUENTE DATOS Y ECUACIONES'!G11*'ENLACES DATOS'!$J$2)","v":84.746334987224003},{"$f":"F21+('FUENTE DATOS Y ECUACIONES'!G11*'ENLACES DATOS'!$J$2)","v":153.031442790554},0.99299999999999999,{"$error":"#VALUE!"},"Incrementar producción"]
["OVINO","CARNE","RUMIA IDX/kg MS","OVINOCARNERUMIA IDX/kg MS",{"$f":"('FUENTE DATOS Y ECUACIONES'!$C$40+('FUENTE DATOS Y ECUACIONES'!$D$40*'ENLACES DATOS'!$D$3)+('ENLACES DATOS'!$D$6*'FUENTE DATOS Y ECUACIONES'!$G$40))","v":{"$error":"#VALUE!"}},184.694444444444,{"$f":"F22-('FUENTE DATOS Y ECUACIONES'!G12*'ENLACES DATOS'!$J$2)","v":151.4373448534904},{"$f":"F22+('FUENTE DATOS Y ECUACIONES'!G12*'ENLACES DATOS'!$J$2)","v":217.9515440353976},0.91600000000000004,{"$error":"#VALUE!"},"Funcionamiento de la rumia"]
["OVINO","CARNE","ACID INDEX/kg MS","OVINOCARNEACID INDEX/kg MS",{"$f":"('FUENTE DATOS Y ECUACIONES'!$D$41*'ENLACES DATOS'!$D$3)+'FUENTE DATOS Y ECUACIONES'!$H$41*'ENLACES DATOS'!$D$9","v":{"$error":"#VALUE!"}},27.205555555555598,{"$f":"F23-('FUENTE DATOS Y ECUACIONES'!G13*'ENLACES DATOS'!$J$2)","v":19.455756907528219},{"$f":"F23+('FUENTE DATOS Y ECUACIONES'!G13*'ENLACES DATOS'!$J$2)","v":34.955354203582978},0.99399999999999999,{"$error":"#VALUE!"},"Evitar acidosis"]
["OVINO","CARNE","N_CET/kg MS","OVINOCARNEN_CET/kg MS",{"$f":"($D$3*'FUENTE DATOS Y ECUACIONES'!$D$42)+('FUENTE DATOS Y ECUACIONES'!$F$42*'ENLACES DATOS'!$D$5)","v":{"$error":"#VALUE!"}},146.46666666666701,{"$f":"F24-('FUENTE DATOS Y ECUACIONES'!G14*'ENLACES DATOS'!$J$2)","v":125.29304267498401},{"$f":"F24+('FUENTE DATOS Y ECUACIONES'!G14*'ENLACES DATOS'!$J$2)","v":167.64029065835001},0.996,{"$error":"#VALUE!"},"Aumentar/Evitar engrasamiento animales"]
["OVINO","CARNE","N_GLU/kg MS","OVINOCARNEN_GLU/kg MS",{"$f":"('FUENTE DATOS Y ECUACIONES'!$D$43*'ENLACES DATOS'!$D$3)+('ENLACES DATOS'!$D$7*'FUENTE DATOS Y ECUACIONES'!$I$43)","v":{"$error":"#VALUE!"}},109.555555555556,{"$f":"F25-('FUENTE DATOS Y ECUACIONES'!G15*'ENLACES DATOS'!$J$2)","v":89.994813893259902},{"$f":"F25+('FUENTE DATOS Y ECUACIONES'!G15*'ENLACES DATOS'!$J$2)","v":129.11629721785209},0.99299999999999999,{"$error":"#VALUE!"},"Aumento de eficiencia productiva"]
["OVINO","CARNE","N-END/Kg MS","OVINOCARNEN-END/Kg MS",{"$f":"('FUENTE DATOS Y ECUACIONES'!$D$44*'ENLACES DATOS'!$D$3)+('FUENTE DATOS Y ECUACIONES'!$I$44*'ENLACES DATOS'!$D$7)+($D$5*'FUENTE DATOS Y ECUACIONES'!$F$44)","v":{"$error":"#VALUE!"}},696.77777777777806,{"$f":"F26-('FUENTE DATOS Y ECUACIONES'!G16*'ENLACES DATOS'!$J$2)","v":587.21578589482908},{"$f":"F26+('FUENTE DATOS Y ECUACIONES'!G16*'ENLACES DATOS'!$J$2)","v":806.33976966072703},0.999,{"$error":"#VALUE!"},"Energía dinámica"]
["OVINO","CARNE","N-BPD/Kg MS","OVINOCARNEN-BPD/Kg MS",{"$f":"('FUENTE DATOS Y ECUACIONES'!$C$45+('FUENTE DATOS Y ECUACIONES'!$E$45*'ENLACES DATOS'!$D$4)+('FUENTE DATOS Y ECUACIONES'!$G$45*'ENLACES DATOS'!$D$6))","v":{"$error":"#VALUE!"}},22.3888888888889,{"$f":"F27-('FUENTE DATOS Y ECUACIONES'!G17*'ENLACES DATOS'!$J$2)","v":10.532399532031199},{"$f":"F27+('FUENTE DATOS Y ECUACIONES'!G17*'ENLACES DATOS'!$J$2)","v":34.2453782457466},0.69699999999999995,{"$error":"#VALUE!"},"Balance Energía-Proteína"]
["OVINO","LECHE","N_CHO_RD/kg MS","OVINOLECHEN_CHO_RD/kg MS",{"$f":"('FUENTE DATOS Y ECUACIONES'!$D$39*'ENLACES DATOS'!$D$3)+('ENLACES DATOS'!$D$4*'FUENTE DATOS Y ECUACIONES'!$E$39)+('FUENTE DATOS Y ECUACIONES'!$H$39*'ENLACES DATOS'!$D$9)","v":{"$error":"#VALUE!"}},140.37582417582399,{"$f":"F28-('FUENTE DATOS Y ECUACIONES'!I11*'ENLACES DATOS'!$J$2)","v":114.6137791368341},{"$f":"F28+('FUENTE DATOS Y ECUACIONES'!I11*'ENLACES DATOS'!$J$2)","v":166.13786921481389},0.99299999999999999,{"$error":"#VALUE!"},"Incrementar producción"]
["OVINO","LECHE","RUMIA IDX/kg MS","OVINOLECHERUMIA IDX/kg MS",{"$f":"('FUENTE DATOS Y ECUACIONES'!$C$40+('FUENTE DATOS Y ECUACIONES'!$D$40*'ENLACES DATOS'!$D$3)+('ENLACES DATOS'!$D$6*'FUENTE DATOS Y ECUACIONES'!$G$40))","v":{"$error":"#VALUE!"}},148.773626373626,{"$f":"F29-('FUENTE DATOS Y ECUACIONES'!I12*'ENLACES DATOS'!$J$2)","v":126.55253111526621},{"$f":"F29+('FUENTE DATOS Y ECUACIONES'!I12*'ENLACES DATOS'!$J$2)","v":170.99472163198581},0.91600000000000004,{"$error":"#VALUE!"},"Funcionamiento de la rumia"]
["OVINO","LECHE","ACID INDEX/kg MS","OVINOLECHEACID INDEX/kg MS",{"$f":"('FUENTE DATOS Y ECUACIONES'!$D$41*'ENLACES DATOS'!$D$3)+'FUENTE DATOS Y ECUACIONES'!$H$41*'ENLACES DATOS'!$D$9","v":{"$error":"#VALUE!"}},31.968131868131898,{"$f":"F30-('FUENTE DATOS Y ECUACIONES'!I13*'ENLACES DATOS'!$J$2)","v":26.743151716741988},{"$f":"F30+('FUENTE DATOS Y ECUACIONES'!I13*'ENLACES DATOS'!$J$2)","v":37.193112019521806},0.99399999999999999,{"$error":"#VALUE!"},"Evitar acidosis"]
["OVINO","LECHE","N_CET/kg MS","OVINOLECHEN_CET/kg MS",{"$f":"($D$3*'FUENTE DATOS Y ECUACIONES'!$D$42)+('FUENTE DATOS Y ECUACIONES'!$F$42*'ENLACES DATOS'!$D$5)","v":{"$error":"#VALUE!"}},155.223076923077,{"$f":"F31-('FUENTE DATOS Y ECUACIONES'!I14*'ENLACES DATOS'!$J$2)","v":138.3843446078786},{"$f":"F31+('FUENTE DATOS Y ECUACIONES'!I14*'ENLACES DATOS'!$J$2)","v":172.0618092382754},0.996,{"$error":"#VALUE!"},"Incremento de grasa en leche"]
["OVINO","LECHE","N_GLU/kg MS","OVINOLECHEN_GLU/kg MS",{"$f":"('FUENTE DATOS Y ECUACIONES'!$D$43*'ENLACES DATOS'!$D$3)+('ENLACES DATOS'!$D$7*'FUENTE DATOS Y ECUACIONES'!$I$43)","v":{"$error":"#VALUE!"}},134.542857142857,{"$f":"F32-('FUENTE DATOS Y ECUACIONES'!I15*'ENLACES DATOS'!$J$2)","v":111.39886275574911},{"$f":"F32+('FUENTE DATOS Y ECUACIONES'!I15*'ENLACES DATOS'!$J$2)","v":157.68685152996491},0.99299999999999999,{"$error":"#VALUE!"},"Evitar toxemias de gestación"]
["OVINO","LECHE","N-END/Kg MS","OVINOLECHEN-END/Kg MS",{"$f":"('FUENTE DATOS Y ECUACIONES'!$D$44*'ENLACES DATOS'!$D$3)+('FUENTE DATOS Y ECUACIONES'!$I$44*'ENLACES DATOS'!$D$7)+($D$5*'FUENTE DATOS Y ECUACIONES'!$F$44)","v":{"$error":"#VALUE!"}},796.02197802197804,{"$f":"F33-('FUENTE DATOS Y ECUACIONES'!I16*'ENLACES DATOS'!$J$2)","v":692.51728376214407},{"$f":"F33+('FUENTE DATOS Y ECUACIONES'!I16*'ENLACES DATOS'!$J$2)","v":899.52667228181201},0.999,{"$error":"#VALUE!"},"Energía dinámica"]
["OVINO","LECHE","N-BPD/Kg MS","OVINOLECHEN-BPD/Kg MS",{"$f":"('FUENTE DATOS Y ECUACIONES'!$C$45+('FUENTE DATOS Y ECUACIONES'!$E$45*'ENLACES DATOS'!$D$4)+('FUENTE DATOS Y ECUACIONES'!$G$45*'ENLACES DATOS'!$D$6))","v":{"$error":"#VALUE!"}},22.457142857142902,{"$f":"F34-('FUENTE DATOS Y ECUACIONES'!I17*'ENLACES DATOS'!$J$2)","v":10.722510894376102},{"$f":"F34+('FUENTE DATOS Y ECUACIONES'!I17*'ENLACES DATOS'!$J$2)","v":34.191774819909703},0.69699999999999995,{"$error":"#VALUE!"},"Balance Energía-Proteína"]
[]
[]
[]
[]
[null,null,"UF",{"$f":"IF(F39=\"\",\"\",F39)","v":""},null,{"$f":"IF(PIENSOS!G7=\"\",\"\",PIENSOS!G7)","v":""},"UFL",{"$f":"IF(F40=\"\",\"\",'FUENTE DATOS Y ECUACIONES'!C60+('FUENTE DATOS Y ECUACIONES'!E60*'ENLACES DATOS'!D40)+('ENLACES DATOS'!D41*'FUENTE DATOS Y ECUACIONES'!F60)+('FUENTE DATOS Y ECUACIONES'!G60*'ENLACES DATOS'!D42)+('FUENTE DATOS Y ECUACIONES'!H60*'ENLACES DATOS'!D43))","v":""}]
[null,null,"PB",{"$f":"IF(F40=\"\",\"\",F40*1000)","v":""},null,{"$f":"IF(PIENSOS!G8=\"\",\"\",PIENSOS!G8)","v":""},"UFV",{"$f":"IF(F40=\"\",\"\",'FUENTE DATOS Y ECUACIONES'!C61+('FUENTE DATOS Y ECUACIONES'!E61*'ENLACES DATOS'!D40)+('ENLACES DATOS'!D41*'FUENTE DATOS Y ECUACIONES'!F61)+('FUENTE DATOS Y ECUACIONES'!G61*'ENLACES DATOS'!D42)+('ENLACES DATOS'!D43*'FUENTE DATOS Y ECUACIONES'!H61))","v":""},null,"RANGO CONFIANZA"]
[null,null,"GB",{"$f":"IF(F41=\"\",\"\",F41*1000)","v":""},null,{"$f":"IF(PIENSOS!G9=\"\",\"\",PIENSOS!G9)","v":""},"UF",{"$f":"IF(H39=\"\",\"\",(H39*0.65)+(H40*0.35))","v":""},null,{"$f":"IF(PIENSOS!C11=\"\",1,PIENSOS!C11)","v":1}]
[null,null,"FB","",null,{"$f":"IF(PIENSOS!G10=\"\",\"\",PIENSOS!G10)","v":""}]
[null,null,"Cenizas","",null,{"$f":"IF(PIENSOS!G11=\"\",\"\",PIENSOS!G11)","v":""}]
[null,null,"Almidon","",null,{"$f":"IF(PIENSOS!G12=\"\",\"\",PIENSOS!G12)","v":""}]
[]
[]
[]
[null,null,null,null,null,null,null,null,null,null,null,null,null,null,null,null,"UTILIDAD","VALOR","REFERENCIA","LIMITE MINIMO","LIMITE MAXIMO","R","% VARIABILIDAD"]
["PIENSOS",null,null,null,"VALOR","REFERENCIA","LIMITE MINIMO","LIMITE MAXIMO","R","% VARIABILIDAD","UTILIDAD",null,null,{"$f":"IF(PIENSOS!$C$10=\"\",\"\",PIENSOS!$C$10)","v":""},"N_CHO_RD",{"$f":"CONCATENATE(M49,N49,O49)","v":"N_CHO_RD"},{"$f":"IF($F39=\"\",\"\",VLOOKUP($P49,$D$50:$K$77,Q$56,FALSE))","v":""},{"$f":"IF($F39=\"\",\"\",VLOOKUP($P49,$D$50:$K$77,R$56,FALSE))","v":""},"",{"$f":"IF($F39=\"\",\"\",VLOOKUP($P49,$D$50:$K$77,T$56,FALSE))","v":""},"","",""]
[null,"CEBO","N_CHO_RD",{"$f":"CONCATENATE(A50,B50,C50)","v":"CEBON_CHO_RD"},{"$f":"'FUENTE DATOS Y ECUACIONES'!$C$49+('FUENTE DATOS Y ECUACIONES'!$I$49*'ENLACES DATOS'!$D$44)","v":{"$error":"#VALUE!"}},236.82105263157899,{"$f":"F50-($J$41*'FUENTE DATOS Y ECUACIONES'!E27)","v":217.39227732427929},{"$f":"F50+($J$41*'FUENTE DATOS Y ECUACIONES'!E27)","v":256.2498279388787},0.86099999999999999,{"$f":"(E50-F50)/F50","v":{"$error":"#VALUE!"}},"Incrementar crecimiento",null,null,{"$f":"IF(PIENSOS!$C$10=\"\",\"\",PIENSOS!$C$10)","v":""},"RUMIA IDX","RUMIA IDX",{"$f":"IF($F40=\"\",\"\",VLOOKUP($P50,$D$50:$K$77,Q$56,FALSE))","v":""},"","",{"$f":"IF($F40=\"\",\"\",VLOOKUP($P50,$D$50:$K$77,T$56,FALSE))","v":""},"","",""]
[null,"CEBO","RUMIA IDX","CEBORUMIA IDX",{"$f":"'FUENTE DATOS Y ECUACIONES'!$C$50+('FUENTE DATOS Y ECUACIONES'!$D$50*'ENLACES DATOS'!$D$39)+('ENLACES DATOS'!$D$42*'FUENTE DATOS Y ECUACIONES'!$G$50)","v":{"$error":"#VALUE!"}},31.768421052631599,{"$f":"F51-($J$41*'FUENTE DATOS Y ECUACIONES'!E28)","v":26.954546125624717},{"$f":"F51+($J$41*'FUENTE DATOS Y ECUACIONES'!E28)","v":36.582295979638481},0.96799999999999997,{"$f":"(E51-F51)/F51","v":{"$error":"#VALUE!"}},"Funcionamiento de la rumia",null,null,{"$f":"IF(PIENSOS!$C$10=\"\",\"\",PIENSOS!$C$10)","v":""},"ACID INDEX","ACID INDEX",{"$f":"IF($F41=\"\",\"\",VLOOKUP($P51,$D$50:$K$77,Q$56,FALSE))","v":""},"","",{"$f":"IF($F41=\"\",\"\",VLOOKUP($P51,$D$50:$K$77,T$56,FALSE))","v":""},"","",""]
[null,"CEBO","ACID INDEX","CEBOACID INDEX",{"$f":"'FUENTE DATOS Y ECUACIONES'!$C$51+('FUENTE DATOS Y ECUACIONES'!$I$51*'ENLACES DATOS'!$D$44)","v":{"$error":"#VALUE!"}},46.405263157894701,{"$f":"F52-($J$41*'FUENTE DATOS Y ECUACIONES'!E29)","v":41.740087957634429},{"$f":"F52+($J$41*'FUENTE DATOS Y ECUACIONES'!E29)","v":51.070438358154973},0.83399999999999996,{"$error":"#VALUE!"},"Evitar acidosis",null,null,{"$f":"IF(PIENSOS!$C$10=\"\",\"\",PIENSOS!$C$10)","v":""},"N_CET","N_CET",{"$f":"IF($F42=\"\",\"\",VLOOKUP($P52,$D$50:$K$77,Q$56,FALSE))","v":""},"","",{"$f":"IF($F42=\"\",\"\",VLOOKUP($P52,$D$50:$K$77,T$56,FALSE))","v":""},"","",""]
[null,"CEBO","N_CET","CEBON_CET",{"$f":"'FUENTE DATOS Y ECUACIONES'!$C$52+('FUENTE DATOS Y ECUACIONES'!$D$52*'ENLACES DATOS'!$D$39)+('ENLACES DATOS'!$D$41*'FUENTE DATOS Y ECUACIONES'!$F$52)+('FUENTE DATOS Y ECUACIONES'!$H$52*'ENLACES DATOS'!$D$43)","v":{"$error":"#VALUE!"}},173.63684210526301,{"$f":"F53-($J$41*'FUENTE DATOS Y ECUACIONES'!E30)","v":165.31256632586587},{"$f":"F53+($J$41*'FUENTE DATOS Y ECUACIONES'!E30)","v":181.96111788466015},0.77200000000000002,{"$error":"#VALUE!"},"Aumentar/Evitar engrasamiento animales",null,null,{"$f":"IF(PIENSOS!$C$10=\"\",\"\",PIENSOS!$C$10)","v":""},"N_GLU","N_GLU",{"$f":"IF($F43=\"\",\"\",VLOOKUP($P53,$D$50:$K$77,Q$56,FALSE))","v":""},"","",{"$f":"IF($F43=\"\",\"\",VLOOKUP($P53,$D$50:$K$77,T$56,FALSE))","v":""},"","",""]
[null,"CEBO","N_GLU","CEBON_GLU",{"$f":"($D$39*'FUENTE DATOS Y ECUACIONES'!$D$53)+('FUENTE DATOS Y ECUACIONES'!$I$53*'ENLACES DATOS'!$D$44)","v":{"$error":"#VALUE!"}},208.81052631578899,{"$f":"F54-($J$41*'FUENTE DATOS Y ECUACIONES'!E31)","v":201.28236476237524},{"$f":"F54+($J$41*'FUENTE DATOS Y ECUACIONES'!E31)","v":216.33868786920274},0.999,{"$error":"#VALUE!"},"Aumento de eficiencia productiva",null,null,{"$f":"IF(PIENSOS!$C$10=\"\",\"\",PIENSOS!$C$10)","v":""},"N-END","N-END",{"$f":"IF($F44=\"\",\"\",VLOOKUP($P54,$D$50:$K$77,Q$56,FALSE))","v":""},"","",{"$f":"IF($F44=\"\",\"\",VLOOKUP($P54,$D$50:$K$77,T$56,FALSE))","v":""},"","",""]
[null,"CEBO","N-END","CEBON-END",{"$f":"($D$39*'FUENTE DATOS Y ECUACIONES'!$D$54)+'FUENTE DATOS Y ECUACIONES'!$C$54","v":{"$error":"#VALUE!"}},1050.6315789473699,{"$f":"F55-($J$41*'FUENTE DATOS Y ECUACIONES'!E32)","v":1004.0981852913491},{"$f":"F55+($J$41*'FUENTE DATOS Y ECUACIONES'!E32)","v":1097.1649726033907},0.89400000000000002,{"$error":"#VALUE!"},"Energía dinámica",null,null,{"$f":"IF(PIENSOS!$C$10=\"\",\"\",PIENSOS!$C$10)","v":""},"N-BPD","N-BPD",{"$f":"IF($F44=\"\",\"\",VLOOKUP($P55,$D$50:$K$77,Q$56,FALSE))","v":""},{"$f":"IF($F44=\"\",\"\",VLOOKUP($P55,$D$50:$K$77,R$56,FALSE))","v":""},"",{"$f":"IF($F44=\"\",\"\",VLOOKUP($P55,$D$50:$K$77,T$56,FALSE))","v":""},"","",""]
[null,"CEBO","N-BPD","CEBON-BPD",{"$f":"($D$42*'FUENTE DATOS Y ECUACIONES'!$G$55)+('FUENTE DATOS Y ECUACIONES'!$E$55*'ENLACES DATOS'!$D$40)+'FUENTE DATOS Y ECUACIONES'!$C$55","v":{"$error":"#VALUE!"}},10.5526315789474,{"$f":"F56-($J$41*'FUENTE DATOS Y ECUACIONES'!E33)","v":-0.81121794590080043},{"$f":"F56+($J$41*'FUENTE DATOS Y ECUACIONES'!E33)","v":21.916481103795601},0.86399999999999999,{"$error":"#VALUE!"},"Balance Energía-Proteína",null,null,null,null,1,8,2,3,4,5,6,7]
[null,"ORDEÑO","N_CHO_RD","ORDEÑON_CHO_RD",{"$f":"'FUENTE DATOS Y ECUACIONES'!$C$49+('FUENTE DATOS Y ECUACIONES'!$I$49*'ENLACES DATOS'!$D$44)","v":{"$error":"#VALUE!"}},174.361538461538,{"$f":"F57-($J$41*'FUENTE DATOS Y ECUACIONES'!G27)","v":155.379022889678},{"$f":"F57+($J$41*'FUENTE DATOS Y ECUACIONES'!G27)","v":193.34405403339801},0.86099999999999999,{"$error":"#VALUE!"},"Incrementar producción"]
[null,"ORDEÑO","RUMIA IDX","ORDEÑORUMIA IDX",{"$f":"'FUENTE DATOS Y ECUACIONES'!$C$50+('FUENTE DATOS Y ECUACIONES'!$D$50*'ENLACES DATOS'!$D$39)+('ENLACES DATOS'!$D$42*'FUENTE DATOS Y ECUACIONES'!$G$50)","v":{"$error":"#VALUE!"}},49.984615384615402,{"$f":"F58-($J$41*'FUENTE DATOS Y ECUACIONES'!G28)","v":42.35453826029498},{"$f":"F58+($J$41*'FUENTE DATOS Y ECUACIONES'!G28)","v":57.614692508935825},0.96799999999999997,{"$error":"#VALUE!"},"Funcionamiento de la rumia"]
[null,"ORDEÑO","ACID INDEX","ORDEÑOACID INDEX",{"$f":"'FUENTE DATOS Y ECUACIONES'!$C$51+('FUENTE DATOS Y ECUACIONES'!$I$51*'ENLACES DATOS'!$D$44)","v":{"$error":"#VALUE!"}},35.846153846153797,{"$f":"F59-($J$41*'FUENTE DATOS Y ECUACIONES'!G29)","v":30.050952471364567},{"$f":"F59+($J$41*'FUENTE DATOS Y ECUACIONES'!G29)","v":41.641355220943026},0.83399999999999996,{"$error":"#VALUE!"},"Evitar acidosis",null,null,{"$f":"IF(PIENSOS!$C$10=\"\",\"\",PIENSOS!$C$10)","v":""},{"$f":"IF(PIENSOS!I25=\"\",\"\",PIENSOS!I25)","v":""},{"$f":"CONCATENATE(M59,N59,O59)","v":""},{"$f":"IF($O59=\"\",\"\",VLOOKUP($P59,$D$50:$K$77,Q$56,FALSE))","v":""},{"$f":"IF($O59=\"\",\"\",VLOOKUP($P59,$D$50:$K$77,R$56,FALSE))","v":""},{"$f":"IF($O59=\"\",\"\",VLOOKUP($P59,$D$50:$K$77,S$56,FALSE))","v":""},"",""]
[null,"ORDEÑO","N_CET","ORDEÑON_CET",{"$f":"'FUENTE DATOS Y ECUACIONES'!$C$52+('FUENTE DATOS Y ECUACIONES'!$D$52*'ENLACES DATOS'!$D$39)+('ENLACES DATOS'!$D$41*'FUENTE DATOS Y ECUACIONES'!$F$52)+('FUENTE DATOS Y ECUACIONES'!$H$52*'ENLACES DATOS'!$D$43)","v":{"$error":"#VALUE!"}},171.592307692308,{"$f":"F60-($J$41*'FUENTE DATOS Y ECUACIONES'!G30)","v":165.20410743213199},{"$f":"F60+($J$41*'FUENTE DATOS Y ECUACIONES'!G30)","v":177.980507952484},0.77200000000000002,{"$error":"#VALUE!"},"Incremento de grasa en leche"]
[null,"ORDEÑO","N_GLU","ORDEÑON_GLU",{"$f":"($D$39*'FUENTE DATOS Y ECUACIONES'!$D$53)+('FUENTE DATOS Y ECUACIONES'!$I$53*'ENLACES DATOS'!$D$44)","v":{"$error":"#VALUE!"}},160.79230769230799,{"$f":"F61-($J$41*'FUENTE DATOS Y ECUACIONES'!G31)","v":142.87502267018178},{"$f":"F61+($J$41*'FUENTE DATOS Y ECUACIONES'!G31)","v":178.70959271443419},0.999,{"$error":"#VALUE!"},"Evitar toxemias de gestación"]
[null,"ORDEÑO","N-END","ORDEÑON-END",{"$f":"($D$39*'FUENTE DATOS Y ECUACIONES'!$D$54)+'FUENTE DATOS Y ECUACIONES'!$C$54","v":{"$error":"#VALUE!"}},947.92307692307702,{"$f":"F62-($J$41*'FUENTE DATOS Y ECUACIONES'!G32)","v":906.42717042122717},{"$f":"F62+($J$41*'FUENTE DATOS Y ECUACIONES'!G32)","v":989.41898342492686},0.89400000000000002,{"$error":"#VALUE!"},"Energía dinámica"]
[null,"ORDEÑO","N-BPD","ORDEÑON-BPD",{"$f":"($D$42*'FUENTE DATOS Y ECUACIONES'!$G$55)+('FUENTE DATOS Y ECUACIONES'!$E$55*'ENLACES DATOS'!$D$40)+'FUENTE DATOS Y ECUACIONES'!$C$55","v":{"$error":"#VALUE!"}},36.5,{"$f":"F63-($J$41*'FUENTE DATOS Y ECUACIONES'!G33)","v":30.062997592046461},{"$f":"F63+($J$41*'FUENTE DATOS Y ECUACIONES'!G33)","v":42.937002407953543},0.86399999999999999,{"$error":"#VALUE!"},"Balance Energía-Proteína"]
[null,"PREPARTO","N_CHO_RD","PREPARTON_CHO_RD",{"$f":"'FUENTE DATOS Y ECUACIONES'!$C$49+('FUENTE DATOS Y ECUACIONES'!$I$49*'ENLACES DATOS'!$D$44)","v":{"$error":"#VALUE!"}},201.73333333333301,{"$f":"F64-($J$41*'FUENTE DATOS Y ECUACIONES'!I27)","v":188.2795854044725},{"$f":"F64+($J$41*'FUENTE DATOS Y ECUACIONES'!I27)","v":215.18708126219352},0.86099999999999999,{"$error":"#VALUE!"},"Incrementar producción"]
[null,"PREPARTO","RUMIA IDX","PREPARTORUMIA IDX",{"$f":"'FUENTE DATOS Y ECUACIONES'!$C$50+('FUENTE DATOS Y ECUACIONES'!$D$50*'ENLACES DATOS'!$D$39)+('ENLACES DATOS'!$D$42*'FUENTE DATOS Y ECUACIONES'!$G$50)","v":{"$error":"#VALUE!"}},40.200000000000003,{"$f":"F65-($J$41*'FUENTE DATOS Y ECUACIONES'!I28)","v":39.764110105645699},{"$f":"F65+($J$41*'FUENTE DATOS Y ECUACIONES'!I28)","v":40.635889894354307},0.96799999999999997,{"$error":"#VALUE!"},"Funcionamiento de la rumia"]
[null,"PREPARTO","ACID INDEX","PREPARTOACID INDEX",{"$f":"'FUENTE DATOS Y ECUACIONES'!$C$51+('FUENTE DATOS Y ECUACIONES'!$I$51*'ENLACES DATOS'!$D$44)","v":{"$error":"#VALUE!"}},42.233333333333299,{"$f":"F66-($J$41*'FUENTE DATOS Y ECUACIONES'!I29)","v":38.469912903281276},{"$f":"F66+($J$41*'FUENTE DATOS Y ECUACIONES'!I29)","v":45.996753763385321},0.83399999999999996,{"$error":"#VALUE!"},"Evitar acidosis"]
[null,"PREPARTO","N_CET","PREPARTON_CET",{"$f":"'FUENTE DATOS Y ECUACIONES'!$C$52+('FUENTE DATOS Y ECUACIONES'!$D$52*'ENLACES DATOS'!$D$39)+('ENLACES DATOS'!$D$41*'FUENTE DATOS Y ECUACIONES'!$F$52)+('FUENTE DATOS Y ECUACIONES'!$H$52*'ENLACES DATOS'!$D$43)","v":{"$error":"#VALUE!"}},161.30000000000001,{"$f":"F67-($J$41*'FUENTE DATOS Y ECUACIONES'!I30)","v":157.33389359698953},{"$f":"F67+($J$41*'FUENTE DATOS Y ECUACIONES'!I30)","v":165.2661064030105},0.77200000000000002,{"$error":"#VALUE!"},"Evitar engrasamiento de animales"]
[null,"PREPARTO","N_GLU","PREPARTON_GLU",{"$f":"($D$39*'FUENTE DATOS Y ECUACIONES'!$D$53)+('FUENTE DATOS Y ECUACIONES'!$I$53*'ENLACES DATOS'!$D$44)","v":{"$error":"#VALUE!"}},195.166666666667,{"$f":"F68-($J$41*'FUENTE DATOS Y ECUACIONES'!I31)","v":181.56323572688839},{"$f":"F68+($J$41*'FUENTE DATOS Y ECUACIONES'!I31)","v":208.7700976064456},0.999,{"$error":"#VALUE!"},"Evitar toxemias de gestación"]
[null,"PREPARTO","N-END","PREPARTON-END",{"$f":"($D$39*'FUENTE DATOS Y ECUACIONES'!$D$54)+'FUENTE DATOS Y ECUACIONES'!$C$54","v":{"$error":"#VALUE!"}},955.66666666666697,{"$f":"F69-($J$41*'FUENTE DATOS Y ECUACIONES'!I32)","v":929.03335419274936},{"$f":"F69+($J$41*'FUENTE DATOS Y ECUACIONES'!I32)","v":982.29997914058458},0.89400000000000002,{"$error":"#VALUE!"},"Energía dinámica"]
[null,"PREPARTO","N-BPD","PREPARTON-BPD",{"$f":"($D$42*'FUENTE DATOS Y ECUACIONES'!$G$55)+('FUENTE DATOS Y ECUACIONES'!$E$55*'ENLACES DATOS'!$D$40)+'FUENTE DATOS Y ECUACIONES'!$C$55","v":{"$error":"#VALUE!"}},10.7,{"$f":"F70-($J$41*'FUENTE DATOS Y ECUACIONES'!I33)","v":1.9290251397008298},{"$f":"F70+($J$41*'FUENTE DATOS Y ECUACIONES'!I33)","v":19.470974860299169},0.86399999999999999,{"$error":"#VALUE!"},"Balance Energía-Proteína"]
[null,"RECRIA","N_CHO_RD","RECRIAN_CHO_RD",{"$f":"'FUENTE DATOS Y ECUACIONES'!$C$49+('FUENTE DATOS Y ECUACIONES'!$I$49*'ENLACES DATOS'!$D$44)","v":{"$error":"#VALUE!"}},195.333333333333,{"$f":"F71-($J$41*'FUENTE DATOS Y ECUACIONES'!K27)","v":191.39336717442558},{"$f":"F71-($J$41*'FUENTE DATOS Y ECUACIONES'!K27)","v":191.39336717442558},0.86099999999999999,{"$error":"#VALUE!"},"Incrementar crecimiento"]
[null,"RECRIA","RUMIA IDX","RECRIARUMIA IDX",{"$f":"'FUENTE DATOS Y ECUACIONES'!$C$50+('FUENTE DATOS Y ECUACIONES'!$D$50*'ENLACES DATOS'!$D$39)+('ENLACES DATOS'!$D$42*'FUENTE DATOS Y ECUACIONES'!$G$50)","v":{"$error":"#VALUE!"}},45.1,{"$f":"F72-($J$41*'FUENTE DATOS Y ECUACIONES'!K28)","v":39.869321267751253},{"$f":"F72-($J$41*'FUENTE DATOS Y ECUACIONES'!K28)","v":39.869321267751253},0.96799999999999997,{"$error":"#VALUE!"},"Funcionamiento de la rumia"]
[null,"RECRIA","ACID INDEX","RECRIAACID INDEX",{"$f":"'FUENTE DATOS Y ECUACIONES'!$C$51+('FUENTE DATOS Y ECUACIONES'!$I$51*'ENLACES DATOS'!$D$44)","v":{"$error":"#VALUE!"}},41.7,{"$f":"F73-($J$41*'FUENTE DATOS Y ECUACIONES'!K29)","v":40.190033112945834},{"$f":"F73-($J$41*'FUENTE DATOS Y ECUACIONES'!K29)","v":40.190033112945834},0.83399999999999996,{"$error":"#VALUE!"},"Evitar acidosis"]
[null,"RECRIA","N_CET","RECRIAN_CET",{"$f":"'FUENTE DATOS Y ECUACIONES'!$C$52+('FUENTE DATOS Y ECUACIONES'!$D$52*'ENLACES DATOS'!$D$39)+('ENLACES DATOS'!$D$41*'FUENTE DATOS Y ECUACIONES'!$F$52)+('FUENTE DATOS Y ECUACIONES'!$H$52*'ENLACES DATOS'!$D$43)","v":{"$error":"#VALUE!"}},166.8,{"$f":"F74-($J$41*'FUENTE DATOS Y ECUACIONES'!K30)","v":164.89212159716755},{"$f":"F74-($J$41*'FUENTE DATOS Y ECUACIONES'!K30)","v":164.89212159716755},0.77200000000000002,{"$error":"#VALUE!"},"Aumentar/Evitar engrasamiento animales"]
[null,"RECRIA","N_GLU","RECRIAN_GLU",{"$f":"($D$39*'FUENTE DATOS Y ECUACIONES'!$D$53)+('FUENTE DATOS Y ECUACIONES'!$I$53*'ENLACES DATOS'!$D$44)","v":{"$error":"#VALUE!"}},183.166666666667,{"$f":"F75-($J$41*'FUENTE DATOS Y ECUACIONES'!K31)","v":164.90076035645811},{"$f":"F75-($J$41*'FUENTE DATOS Y ECUACIONES'!K31)","v":164.90076035645811},0.999,{"$error":"#VALUE!"},"Aumento de eficiencia productiva"]
[null,"RECRIA","N-END","RECRIAN-END",{"$f":"($D$39*'FUENTE DATOS Y ECUACIONES'!$D$54)+'FUENTE DATOS Y ECUACIONES'!$C$54","v":{"$error":"#VALUE!"}},953.33333333333303,{"$f":"F76-($J$41*'FUENTE DATOS Y ECUACIONES'!K32)","v":931.73858088433906},{"$f":"F76-($J$41*'FUENTE DATOS Y ECUACIONES'!K32)","v":931.73858088433906},0.89400000000000002,{"$error":"#VALUE!"},"Energía dinámica"]
[null,"RECRIA","N-BPD","RECRIAN-BPD",{"$f":"($D$42*'FUENTE DATOS Y ECUACIONES'!$G$55)+('FUENTE DATOS Y ECUACIONES'!$E$55*'ENLACES DATOS'!$D$40)+'FUENTE DATOS Y ECUACIONES'!$C$55","v":{"$error":"#VALUE!"}},23.466666666666701,{"$f":"F77-($J$41*'FUENTE DATOS Y ECUACIONES'!K33)","v":23.161161620335953},{"$f":"F77-($J$41*'FUENTE DATOS Y ECUACIONES'!K33)","v":23.161161620335953},0.86399999999999999,{"$error":"#VALUE!"},"Balance Energía-Proteína"]
[]
[]
[]
[]
[]
["CAPRINO"]
["OVINO"]
[null,null,null,null,"CAPRINO","PESO VIVO",{"$f":"IF('HACER RACION'!D13=\"\",\"\",'HACER RACION'!D13)","v":""}]
["LECHE",null,null,null,"CAPRINO","LITROS/DIA",{"$f":"IF('HACER RACION'!D14=\"\",\"\",'HACER RACION'!D14)","v":""}]
["CARNE",null,null,null,"CAPRINO","GRASA LECHE (gramos)",{"$f":"IF('HACER RACION'!D15=\"\",\"\",'HACER RACION'!D15)","v":""}]
[null,null,null,null,"CAPRINO","PROTEINA LECHE (gramos)",{"$f":"IF('HACER RACION'!D16=\"\",\"\",'HACER RACION'!D16)","v":""}]
[null,null,null,null,"CAPRINO","MES DE GESTACION",{"$f":"IF('HACER RACION'!D17=\"\",\"\",'HACER RACION'!D17)","v":""}]
["CEBO",null,null,null,"CAPRINO","MES DE LACTACION",{"$f":"IF('HACER RACION'!D18=\"\",\"\",'HACER RACION'!D18)","v":""}]
["ORDEÑO",null,null,null,"CAPRINO","DISTANCIA RECORRIDA (Km)",{"$f":"IF('HACER RACION'!D19=\"\",\"\",'HACER RACION'!D19)","v":""}]
["PREPARTO",null,null,null,"OVINO","TIPO OVEJA",{"$f":"IF('HACER RACION'!D21=\"\",\"\",'HACER RACION'!D21)","v":""}]
["RECRIA",null,null,null,"OVINO","PESO VIVO",{"$f":"IF('HACER RACION'!D22=\"\",\"\",'HACER RACION'!D22)","v":""}]
[null,null,null,null,"OVINO","LECHE/DIA",{"$f":"IF('HACER RACION'!D23=\"\",\"\",'HACER RACION'!D23)","v":""}]
[null,null,null,null,"OVINO","GRASA LECHE (gramos)",{"$f":"IF('HACER RACION'!D24=\"\",\"\",'HACER RACION'!D24)","v":""}]
[null,null,null,null,"OVINO","PROTEINA LECHE (gramos)",{"$f":"IF('HACER RACION'!D25=\"\",\"\",'HACER RACION'!D25)","v":""}]
[null,null,null,null,"OVINO","PESO CAMADA",{"$f":"IF('HACER RACION'!D26=\"\",\"\",'HACER RACION'!D26)","v":""}]
[null,null,null,null,"OVINO","DIAS GESTACION",{"$f":"IF('HACER RACION'!D27=\"\",\"\",'HACER RACION'!D27)","v":""}]
[null,null,null,null,"OVINO","TEMPERATURA",{"$f":"IF('HACER RACION'!D28=\"\",\"\",'HACER RACION'!D28)","v":""}]
[]
[null,null,null,null,null,null,null,null,"ESPECIE RACION",{"$f":"IF('HACER RACION'!C10=\"\",\"\",'HACER RACION'!C10)","v":""}]
[]
[null,null,null,null,"CAPRINO","IMS (KgMS)",{"$f":"CONCATENATE(D103,E103,F103)","v":"CAPRINOIMS (KgMS)"},{"$f":"IF(G85=\"\",\"\",'INGESTA MS caprino'!C49)","v":""},null,{"$f":"IF($J$101=\"\",\"\",$J$101)","v":""},"IMS (KgMS)",{"$f":"CONCATENATE(I103,J103,K103)","v":"IMS (KgMS)"},{"$f":"IF($J$101=\"\",\"\",VLOOKUP(L103,$G$103:$H$116,2,FALSE))","v":""}]
[null,null,null,null,"CAPRINO","UF","CAPRINOUF",{"$f":"IF(G85=\"\",\"\",'ENERGIA caprino'!E51)","v":""},null,{"$f":"IF($J$101=\"\",\"\",$J$101)","v":""},"UF","UF",{"$f":"IF($J$101=\"\",\"\",VLOOKUP(L104,$G$103:$H$116,2,FALSE))","v":""}]
[null,null,null,null,"CAPRINO","gr PDI ","CAPRINOgr PDI ",{"$f":"IF(G85=\"\",\"\",'PROTEINA caprino'!C54)","v":""},null,"","gr PDI ","gr PDI ",""]
[null,null,null,null,"CAPRINO","gr FND","CAPRINOgr FND",{"$f":"IF(G85=\"\",\"\",(G85*'FUENTE DATOS Y ECUACIONES'!C68))","v":""},null,"","gr FND","gr FND",""]
[null,null,null,null,"CAPRINO","gr GB (máximo)","CAPRINOgr GB (máximo)",{"$f":"IF(G85=\"\",\"\",H103*'FUENTE DATOS Y ECUACIONES'!C69)","v":""},null,"","gr GB (máximo)","gr GB (máximo)",""]
[null,null,null,null,"CAPRINO","gr Ca","CAPRINOgr Ca",{"$f":"IF(G85=\"\",\"\",H103*'FUENTE DATOS Y ECUACIONES'!C66)","v":""},null,"","gr Ca","gr Ca",""]
[null,null,null,null,"CAPRINO","gr P","CAPRINOgr P",{"$f":"IF(G85=\"\",\"\",'FUENTE DATOS Y ECUACIONES'!C67*H103)","v":""},null,"","gr P","gr P",""]
[null,null,null,null,"OVINO","IMS (KgMS)","OVINOIMS (KgMS)",{"$f":"IF(G93=\"\",\"\",'INGESTA MS ovino'!C47)","v":""}]
[null,null,null,null,"OVINO","UF","OVINOUF",{"$f":"IF(G93=\"\",\"\",'ENERGIA ovino'!E62)","v":""}]
[null,null,null,null,"OVINO","gr PDI ","OVINOgr PDI ",{"$f":"IF(G93=\"\",\"\",'PROTEINA ovino'!C60)","v":""}]
[null,null,null,null,"OVINO","gr FND","OVINOgr FND",{"$f":"IF(G93=\"\",\"\",'FUENTE DATOS Y ECUACIONES'!C68*'ENLACES DATOS'!G93)","v":""}]
[null,null,null,null,"OVINO","gr GB (máximo)","OVINOgr GB (máximo)",{"$f":"IF(G93=\"\",\"\",'FUENTE DATOS Y ECUACIONES'!C69*'ENLACES DATOS'!H110)","v":""}]
[null,null,null,null,"OVINO","gr Ca","OVINOgr Ca",{"$f":"IF(G93=\"\",\"\",'FUENTE DATOS Y ECUACIONES'!C66*'ENLACES DATOS'!H110)","v":""}]
[null,null,null,null,"OVINO","gr P","OVINOgr P",{"$f":"IF(G93=\"\",\"\",'FUENTE DATOS Y ECUACIONES'!C67*'ENLACES DATOS'!H110)","v":""}]
[]
[]
[]
[]
[]
[]
[]
[]
[1,2,3,4,5,6,7,8,9,10,11,12,13,14,15,16,17,18,19,20]
["Descripción resumida","Kg/dia","MS*","PB*","FB*","GB**","Cenizas*","Almidón am**","Azúcar","FND**","FAD**","LAD**","UFL","UFC","PDIE","PDIN","PDIA","Ca","P","Humedad"]
[{"$f":"IF('HACER RACION'!B32=\"\",\"\",'HACER RACION'!B32)","v":""},{"$f":"IF('HACER RACION'!D32=\"\",\"\",'HACER RACION'!D32)","v":""},{"$f":"IF($A127=\"\",\"\",VLOOKUP($A127,'MATERIAS PRIMAS'!$A$3:$T$119,C$125,FALSE))","v":""},{"$f":"IF($A127=\"\",\"\",VLOOKUP($A127,'MATERIAS PRIMAS'!$A$3:$T$119,D$125,FALSE))","v":""},{"$f":"IF($A127=\"\",\"\",VLOOKUP($A127,'MATERIAS PRIMAS'!$A$3:$T$119,E$125,FALSE))","v":""},{"$f":"IF($A127=\"\",\"\",VLOOKUP($A127,'MATERIAS PRIMAS'!$A$3:$T$119,F$125,FALSE))","v":""},{"$f":"IF($A127=\"\",\"\",VLOOKUP($A127,'MATERIAS PRIMAS'!$A$3:$T$119,G$125,FALSE))","v":""},{"$f":"IF($A127=\"\",\"\",VLOOKUP($A127,'MATERIAS PRIMAS'!$A$3:$T$119,H$125,FALSE))","v":""},{"$f":"IF($A127=\"\",\"\",VLOOKUP($A127,'MATERIAS PRIMAS'!$A$3:$T$119,I$125,FALSE))","v":""},{"$f":"IF($A127=\"\",\"\",VLOOKUP($A127,'MATERIAS PRIMAS'!$A$3:$T$119,J$125,FALSE))","v":""},{"$f":"IF($A127=\"\",\"\",VLOOKUP($A127,'MATERIAS PRIMAS'!$A$3:$T$119,K$125,FALSE))","v":""},{"$f":"IF($A127=\"\",\"\",VLOOKUP($A127,'MATERIAS PRIMAS'!$A$3:$T$119,L$125,FALSE))","v":""},{"$f":"IF($A127=\"\",\"\",VLOOKUP($A127,'MATERIAS PRIMAS'!$A$3:$T$119,M$125,FALSE))","v":""},{"$f":"IF($A127=\"\",\"\",VLOOKUP($A127,'MATERIAS PRIMAS'!$A$3:$T$119,N$125,FALSE))","v":""},{"$f":"IF($A127=\"\",\"\",VLOOKUP($A127,'MATERIAS PRIMAS'!$A$3:$T$119,O$125,FALSE))","v":""},{"$f":"IF($A127=\"\",\"\",VLOOKUP($A127,'MATERIAS PRIMAS'!$A$3:$T$119,P$125,FALSE))","v":""},{"$f":"IF($A127=\"\",\"\",VLOOKUP($A127,'MATERIAS PRIMAS'!$A$3:$T$119,Q$125,FALSE))","v":""},{"$f":"IF($A127=\"\",\"\",VLOOKUP($A127,'MATERIAS PRIMAS'!$A$3:$T$119,R$125,FALSE))","v":""},{"$f":"IF($A127=\"\",\"\",VLOOKUP($A127,'MATERIAS PRIMAS'!$A$3:$T$119,S$125,FALSE))","v":""},{"$f":"IF($A127=\"\",\"\",VLOOKUP($A127,'MATERIAS PRIMAS'!$A$3:$T$119,T$125,FALSE))","v":""}]
[{"$f":"IF('HACER RACION'!B33=\"\",\"\",'HACER RACION'!B33)","v":""},{"$f":"IF('HACER RACION'!D33=\"\",\"\",'HACER RACION'!D33)","v":""},{"$f":"IF($A128=\"\",\"\",VLOOKUP($A128,'MATERIAS PRIMAS'!$A$3:$T$119,C$125,FALSE))","v":""},{"$f":"IF($A128=\"\",\"\",VLOOKUP($A128,'MATERIAS PRIMAS'!$A$3:$T$119,D$125,FALSE))","v":""},{"$f":"IF($A128=\"\",\"\",VLOOKUP($A128,'MATERIAS PRIMAS'!$A$3:$T$119,E$125,FALSE))","v":""},{"$f":"IF($A128=\"\",\"\",VLOOKUP($A128,'MATERIAS PRIMAS'!$A$3:$T$119,F$125,FALSE))","v":""},{"$f":"IF($A128=\"\",\"\",VLOOKUP($A128,'MATERIAS PRIMAS'!$A$3:$T$119,G$125,FALSE))","v":""},{"$f":"IF($A128=\"\",\"\",VLOOKUP($A128,'MATERIAS PRIMAS'!$A$3:$T$119,H$125,FALSE))","v":""},{"$f":"IF($A128=\"\",\"\",VLOOKUP($A128,'MATERIAS PRIMAS'!$A$3:$T$119,I$125,FALSE))","v":""},{"$f":"IF($A128=\"\",\"\",VLOOKUP($A128,'MATERIAS PRIMAS'!$A$3:$T$119,J$125,FALSE))","v":""},{"$f":"IF($A128=\"\",\"\",VLOOKUP($A128,'MATERIAS PRIMAS'!$A$3:$T$119,K$125,FALSE))","v":""},{"$f":"IF($A128=\"\",\"\",VLOOKUP($A128,'MATERIAS PRIMAS'!$A$3:$T$119,L$125,FALSE))","v":""},{"$f":"IF($A128=\"\",\"\",VLOOKUP($A128,'MATERIAS PRIMAS'!$A$3:$T$119,M$125,FALSE))","v":""},{"$f":"IF($A128=\"\",\"\",VLOOKUP($A128,'MATERIAS PRIMAS'!$A$3:$T$119,N$125,FALSE))","v":""},{"$f":"IF($A128=\"\",\"\",VLOOKUP($A128,'MATERIAS PRIMAS'!$A$3:$T$119,O$125,FALSE))","v":""},{"$f":"IF($A128=\"\",\"\",VLOOKUP($A128,'MATERIAS PRIMAS'!$A$3:$T$119,P$125,FALSE))","v":""},{"$f":"IF($A128=\"\",\"\",VLOOKUP($A128,'MATERIAS PRIMAS'!$A$3:$T$119,Q$125,FALSE))","v":""},{"$f":"IF($A128=\"\",\"\",VLOOKUP($A128,'MATERIAS PRIMAS'!$A$3:$T$119,R$125,FALSE))","v":""},{"$f":"IF($A128=\"\",\"\",VLOOKUP($A128,'MATERIAS PRIMAS'!$A$3:$T$119,S$125,FALSE))","v":""},{"$f":"IF($A128=\"\",\"\",VLOOKUP($A128,'MATERIAS PRIMAS'!$A$3:$T$119,T$125,FALSE))","v":""}]
[{"$f":"IF('HACER RACION'!B34=\"\",\"\",'HACER RACION'!B34)","v":""},{"$f":"IF('HACER RACION'!D34=\"\",\"\",'HACER RACION'!D34)","v":""},{"$f":"IF($A129=\"\",\"\",VLOOKUP($A129,'MATERIAS PRIMAS'!$A$3:$T$119,C$125,FALSE))","v":""},{"$f":"IF($A129=\"\",\"\",VLOOKUP($A129,'MATERIAS PRIMAS'!$A$3:$T$119,D$125,FALSE))","v":""},{"$f":"IF($A129=\"\",\"\",VLOOKUP($A129,'MATERIAS PRIMAS'!$A$3:$T$119,E$125,FALSE))","v":""},{"$f":"IF($A129=\"\",\"\",VLOOKUP($A129,'MATERIAS PRIMAS'!$A$3:$T$119,F$125,FALSE))","v":""},{"$f":"IF($A129=\"\",\"\",VLOOKUP($A129,'MATERIAS PRIMAS'!$A$3:$T$119,G$125,FALSE))","v":""},{"$f":"IF($A129=\"\",\"\",VLOOKUP($A129,'MATERIAS PRIMAS'!$A$3:$T$119,H$125,FALSE))","v":""},{"$f":"IF($A129=\"\",\"\",VLOOKUP($A129,'MATERIAS PRIMAS'!$A$3:$T$119,I$125,FALSE))","v":""},{"$f":"IF($A129=\"\",\"\",VLOOKUP($A129,'MATERIAS PRIMAS'!$A$3:$T$119,J$125,FALSE))","v":""},{"$f":"IF($A129=\"\",\"\",VLOOKUP($A129,'MATERIAS PRIMAS'!$A$3:$T$119,K$125,FALSE))","v":""},{"$f":"IF($A129=\"\",\"\",VLOOKUP($A129,'MATERIAS PRIMAS'!$A$3:$T$119,L$125,FALSE))","v":""},{"$f":"IF($A129=\"\",\"\",VLOOKUP($A129,'MATERIAS PRIMAS'!$A$3:$T$119,M$125,FALSE))","v":""},{"$f":"IF($A129=\"\",\"\",VLOOKUP($A129,'MATERIAS PRIMAS'!$A$3:$T$119,N$125,FALSE))","v":""},{"$f":"IF($A129=\"\",\"\",VLOOKUP($A129,'MATERIAS PRIMAS'!$A$3:$T$119,O$125,FALSE))","v":""},{"$f":"IF($A129=\"\",\"\",VLOOKUP($A129,'MATERIAS PRIMAS'!$A$3:$T$119,P$125,FALSE))","v":""},{"$f":"IF($A129=\"\",\"\",VLOOKUP($A129,'MATERIAS PRIMAS'!$A$3:$T$119,Q$125,FALSE))","v":""},{"$f":"IF($A129=\"\",\"\",VLOOKUP($A129,'MATERIAS PRIMAS'!$A$3:$T$119,R$125,FALSE))","v":""},{"$f":"IF($A129=\"\",\"\",VLOOKUP($A129,'MATERIAS PRIMAS'!$A$3:$T$119,S$125,FALSE))","v":""},{"$f":"IF($A129=\"\",\"\",VLOOKUP($A129,'MATERIAS PRIMAS'!$A$3:$T$119,T$125,FALSE))","v":""}]
[{"$f":"IF('HACER RACION'!B35=\"\",\"\",'HACER RACION'!B35)","v":""},{"$f":"IF('HACER RACION'!D35=\"\",\"\",'HACER RACION'!D35)","v":""},{"$f":"IF($A130=\"\",\"\",VLOOKUP($A130,'MATERIAS PRIMAS'!$A$3:$T$119,C$125,FALSE))","v":""},{"$f":"IF($A130=\"\",\"\",VLOOKUP($A130,'MATERIAS PRIMAS'!$A$3:$T$119,D$125,FALSE))","v":""},{"$f":"IF($A130=\"\",\"\",VLOOKUP($A130,'MATERIAS PRIMAS'!$A$3:$T$119,E$125,FALSE))","v":""},{"$f":"IF($A130=\"\",\"\",VLOOKUP($A130,'MATERIAS PRIMAS'!$A$3:$T$119,F$125,FALSE))","v":""},{"$f":"IF($A130=\"\",\"\",VLOOKUP($A130,'MATERIAS PRIMAS'!$A$3:$T$119,G$125,FALSE))","v":""},{"$f":"IF($A130=\"\",\"\",VLOOKUP($A130,'MATERIAS PRIMAS'!$A$3:$T$119,H$125,FALSE))","v":""},{"$f":"IF($A130=\"\",\"\",VLOOKUP($A130,'MATERIAS PRIMAS'!$A$3:$T$119,I$125,FALSE))","v":""},{"$f":"IF($A130=\"\",\"\",VLOOKUP($A130,'MATERIAS PRIMAS'!$A$3:$T$119,J$125,FALSE))","v":""},{"$f":"IF($A130=\"\",\"\",VLOOKUP($A130,'MATERIAS PRIMAS'!$A$3:$T$119,K$125,FALSE))","v":""},{"$f":"IF($A130=\"\",\"\",VLOOKUP($A130,'MATERIAS PRIMAS'!$A$3:$T$119,L$125,FALSE))","v":""},{"$f":"IF($A130=\"\",\"\",VLOOKUP($A130,'MATERIAS PRIMAS'!$A$3:$T$119,M$125,FALSE))","v":""},{"$f":"IF($A130=\"\",\"\",VLOOKUP($A130,'MATERIAS PRIMAS'!$A$3:$T$119,N$125,FALSE))","v":""},{"$f":"IF($A130=\"\",\"\",VLOOKUP($A130,'MATERIAS PRIMAS'!$A$3:$T$119,O$125,FALSE))","v":""},{"$f":"IF($A130=\"\",\"\",VLOOKUP($A130,'MATERIAS PRIMAS'!$A$3:$T$119,P$125,FALSE))","v":""},{"$f":"IF($A130=\"\",\"\",VLOOKUP($A130,'MATERIAS PRIMAS'!$A$3:$T$119,Q$125,FALSE))","v":""},{"$f":"IF($A130=\"\",\"\",VLOOKUP($A130,'MATERIAS PRIMAS'!$A$3:$T$119,R$125,FALSE))","v":""},{"$f":"IF($A130=\"\",\"\",VLOOKUP($A130,'MATERIAS PRIMAS'!$A$3:$T$119,S$125,FALSE))","v":""},{"$f":"IF($A130=\"\",\"\",VLOOKUP($A130,'MATERIAS PRIMAS'!$A$3:$T$119,T$125,FALSE))","v":""}]
[{"$f":"IF('HACER RACION'!B36=\"\",\"\",'HACER RACION'!B36)","v":""},{"$f":"IF('HACER RACION'!D36=\"\",\"\",'HACER RACION'!D36)","v":""},{"$f":"IF($A131=\"\",\"\",VLOOKUP($A131,'MATERIAS PRIMAS'!$A$3:$T$119,C$125,FALSE))","v":""},{"$f":"IF($A131=\"\",\"\",VLOOKUP($A131,'MATERIAS PRIMAS'!$A$3:$T$119,D$125,FALSE))","v":""},{"$f":"IF($A131=\"\",\"\",VLOOKUP($A131,'MATERIAS PRIMAS'!$A$3:$T$119,E$125,FALSE))","v":""},{"$f":"IF($A131=\"\",\"\",VLOOKUP($A131,'MATERIAS PRIMAS'!$A$3:$T$119,F$125,FALSE))","v":""},{"$f":"IF($A131=\"\",\"\",VLOOKUP($A131,'MATERIAS PRIMAS'!$A$3:$T$119,G$125,FALSE))","v":""},{"$f":"IF($A131=\"\",\"\",VLOOKUP($A131,'MATERIAS PRIMAS'!$A$3:$T$119,H$125,FALSE))","v":""},{"$f":"IF($A131=\"\",\"\",VLOOKUP($A131,'MATERIAS PRIMAS'!$A$3:$T$119,I$125,FALSE))","v":""},{"$f":"IF($A131=\"\",\"\",VLOOKUP($A131,'MATERIAS PRIMAS'!$A$3:$T$119,J$125,FALSE))","v":""},{"$f":"IF($A131=\"\",\"\",VLOOKUP($A131,'MATERIAS PRIMAS'!$A$3:$T$119,K$125,FALSE))","v":""},{"$f":"IF($A131=\"\",\"\",VLOOKUP($A131,'MATERIAS PRIMAS'!$A$3:$T$119,L$125,FALSE))","v":""},{"$f":"IF($A131=\"\",\"\",VLOOKUP($A131,'MATERIAS PRIMAS'!$A$3:$T$119,M$125,FALSE))","v":""},{"$f":"IF($A131=\"\",\"\",VLOOKUP($A131,'MATERIAS PRIMAS'!$A$3:$T$119,N$125,FALSE))","v":""},{"$f":"IF($A131=\"\",\"\",VLOOKUP($A131,'MATERIAS PRIMAS'!$A$3:$T$119,O$125,FALSE))","v":""},{"$f":"IF($A131=\"\",\"\",VLOOKUP($A131,'MATERIAS PRIMAS'!$A$3:$T$119,P$125,FALSE))","v":""},{"$f":"IF($A131=\"\",\"\",VLOOKUP($A131,'MATERIAS PRIMAS'!$A$3:$T$119,Q$125,FALSE))","v":""},{"$f":"IF($A131=\"\",\"\",VLOOKUP($A131,'MATERIAS PRIMAS'!$A$3:$T$119,R$125,FALSE))","v":""},{"$f":"IF($A131=\"\",\"\",VLOOKUP($A131,'MATERIAS PRIMAS'!$A$3:$T$119,S$125,FALSE))","v":""},{"$f":"IF($A131=\"\",\"\",VLOOKUP($A131,'MATERIAS PRIMAS'!$A$3:$T$119,T$125,FALSE))","v":""}]
[{"$f":"IF('HACER RACION'!B37=\"\",\"\",'HACER RACION'!B37)","v":""},{"$f":"IF('HACER RACION'!D37=\"\",\"\",'HACER RACION'!D37)","v":""},{"$f":"IF($A132=\"\",\"\",VLOOKUP($A132,'MATERIAS PRIMAS'!$A$3:$T$119,C$125,FALSE))","v":""},{"$f":"IF($A132=\"\",\"\",VLOOKUP($A132,'MATERIAS PRIMAS'!$A$3:$T$119,D$125,FALSE))","v":""},{"$f":"IF($A132=\"\",\"\",VLOOKUP($A132,'MATERIAS PRIMAS'!$A$3:$T$119,E$125,FALSE))","v":""},{"$f":"IF($A132=\"\",\"\",VLOOKUP($A132,'MATERIAS PRIMAS'!$A$3:$T$119,F$125,FALSE))","v":""},{"$f":"IF($A132=\"\",\"\",VLOOKUP($A132,'MATERIAS PRIMAS'!$A$3:$T$119,G$125,FALSE))","v":""},{"$f":"IF($A132=\"\",\"\",VLOOKUP($A132,'MATERIAS PRIMAS'!$A$3:$T$119,H$125,FALSE))","v":""},{"$f":"IF($A132=\"\",\"\",VLOOKUP($A132,'MATERIAS PRIMAS'!$A$3:$T$119,I$125,FALSE))","v":""},{"$f":"IF($A132=\"\",\"\",VLOOKUP($A132,'MATERIAS PRIMAS'!$A$3:$T$119,J$125,FALSE))","v":""},{"$f":"IF($A132=\"\",\"\",VLOOKUP($A132,'MATERIAS PRIMAS'!$A$3:$T$119,K$125,FALSE))","v":""},{"$f":"IF($A132=\"\",\"\",VLOOKUP($A132,'MATERIAS PRIMAS'!$A$3:$T$119,L$125,FALSE))","v":""},{"$f":"IF($A132=\"\",\"\",VLOOKUP($A132,'MATERIAS PRIMAS'!$A$3:$T$119,M$125,FALSE))","v":""},{"$f":"IF($A132=\"\",\"\",VLOOKUP($A132,'MATERIAS PRIMAS'!$A$3:$T$119,N$125,FALSE))","v":""},{"$f":"IF($A132=\"\",\"\",VLOOKUP($A132,'MATERIAS PRIMAS'!$A$3:$T$119,O$125,FALSE))","v":""},{"$f":"IF($A132=\"\",\"\",VLOOKUP($A132,'MATERIAS PRIMAS'!$A$3:$T$119,P$125,FALSE))","v":""},{"$f":"IF($A132=\"\",\"\",VLOOKUP($A132,'MATERIAS PRIMAS'!$A$3:$T$119,Q$125,FALSE))","v":""},{"$f":"IF($A132=\"\",\"\",VLOOKUP($A132,'MATERIAS PRIMAS'!$A$3:$T$119,R$125,FALSE))","v":""},{"$f":"IF($A132=\"\",\"\",VLOOKUP($A132,'MATERIAS PRIMAS'!$A$3:$T$119,S$125,FALSE))","v":""},{"$f":"IF($A132=\"\",\"\",VLOOKUP($A132,'MATERIAS PRIMAS'!$A$3:$T$119,T$125,FALSE))","v":""}]
[{"$f":"IF('HACER RACION'!B38=\"\",\"\",'HACER RACION'!B38)","v":""},{"$f":"IF('HACER RACION'!D38=\"\",\"\",'HACER RACION'!D38)","v":""},{"$f":"IF($A133=\"\",\"\",VLOOKUP($A133,'MATERIAS PRIMAS'!$A$3:$T$119,C$125,FALSE))","v":""},{"$f":"IF($A133=\"\",\"\",VLOOKUP($A133,'MATERIAS PRIMAS'!$A$3:$T$119,D$125,FALSE))","v":""},{"$f":"IF($A133=\"\",\"\",VLOOKUP($A133,'MATERIAS PRIMAS'!$A$3:$T$119,E$125,FALSE))","v":""},{"$f":"IF($A133=\"\",\"\",VLOOKUP($A133,'MATERIAS PRIMAS'!$A$3:$T$119,F$125,FALSE))","v":""},{"$f":"IF($A133=\"\",\"\",VLOOKUP($A133,'MATERIAS PRIMAS'!$A$3:$T$119,G$125,FALSE))","v":""},{"$f":"IF($A133=\"\",\"\",VLOOKUP($A133,'MATERIAS PRIMAS'!$A$3:$T$119,H$125,FALSE))","v":""},{"$f":"IF($A133=\"\",\"\",VLOOKUP($A133,'MATERIAS PRIMAS'!$A$3:$T$119,I$125,FALSE))","v":""},{"$f":"IF($A133=\"\",\"\",VLOOKUP($A133,'MATERIAS PRIMAS'!$A$3:$T$119,J$125,FALSE))","v":""},{"$f":"IF($A133=\"\",\"\",VLOOKUP($A133,'MATERIAS PRIMAS'!$A$3:$T$119,K$125,FALSE))","v":""},{"$f":"IF($A133=\"\",\"\",VLOOKUP($A133,'MATERIAS PRIMAS'!$A$3:$T$119,L$125,FALSE))","v":""},{"$f":"IF($A133=\"\",\"\",VLOOKUP($A133,'MATERIAS PRIMAS'!$A$3:$T$119,M$125,FALSE))","v":""},{"$f":"IF($A133=\"\",\"\",VLOOKUP($A133,'MATERIAS PRIMAS'!$A$3:$T$119,N$125,FALSE))","v":""},{"$f":"IF($A133=\"\",\"\",VLOOKUP($A133,'MATERIAS PRIMAS'!$A$3:$T$119,O$125,FALSE))","v":""},{"$f":"IF($A133=\"\",\"\",VLOOKUP($A133,'MATERIAS PRIMAS'!$A$3:$T$119,P$125,FALSE))","v":""},{"$f":"IF($A133=\"\",\"\",VLOOKUP($A133,'MATERIAS PRIMAS'!$A$3:$T$119,Q$125,FALSE))","v":""},{"$f":"IF($A133=\"\",\"\",VLOOKUP($A133,'MATERIAS PRIMAS'!$A$3:$T$119,R$125,FALSE))","v":""},{"$f":"IF($A133=\"\",\"\",VLOOKUP($A133,'MATERIAS PRIMAS'!$A$3:$T$119,S$125,FALSE))","v":""},{"$f":"IF($A133=\"\",\"\",VLOOKUP($A133,'MATERIAS PRIMAS'!$A$3:$T$119,T$125,FALSE))","v":""}]
[{"$f":"IF('HACER RACION'!B39=\"\",\"\",'HACER RACION'!B39)","v":""},{"$f":"IF('HACER RACION'!D39=\"\",\"\",'HACER RACION'!D39)","v":""},{"$f":"IF($A134=\"\",\"\",VLOOKUP($A134,'MATERIAS PRIMAS'!$A$3:$T$119,C$125,FALSE))","v":""},{"$f":"IF($A134=\"\",\"\",VLOOKUP($A134,'MATERIAS PRIMAS'!$A$3:$T$119,D$125,FALSE))","v":""},{"$f":"IF($A134=\"\",\"\",VLOOKUP($A134,'MATERIAS PRIMAS'!$A$3:$T$119,E$125,FALSE))","v":""},{"$f":"IF($A134=\"\",\"\",VLOOKUP($A134,'MATERIAS PRIMAS'!$A$3:$T$119,F$125,FALSE))","v":""},{"$f":"IF($A134=\"\",\"\",VLOOKUP($A134,'MATERIAS PRIMAS'!$A$3:$T$119,G$125,FALSE))","v":""},{"$f":"IF($A134=\"\",\"\",VLOOKUP($A134,'MATERIAS PRIMAS'!$A$3:$T$119,H$125,FALSE))","v":""},{"$f":"IF($A134=\"\",\"\",VLOOKUP($A134,'MATERIAS PRIMAS'!$A$3:$T$119,I$125,FALSE))","v":""},{"$f":"IF($A134=\"\",\"\",VLOOKUP($A134,'MATERIAS PRIMAS'!$A$3:$T$119,J$125,FALSE))","v":""},{"$f":"IF($A134=\"\",\"\",VLOOKUP($A134,'MATERIAS PRIMAS'!$A$3:$T$119,K$125,FALSE))","v":""},{"$f":"IF($A134=\"\",\"\",VLOOKUP($A134,'MATERIAS PRIMAS'!$A$3:$T$119,L$125,FALSE))","v":""},{"$f":"IF($A134=\"\",\"\",VLOOKUP($A134,'MATERIAS PRIMAS'!$A$3:$T$119,M$125,FALSE))","v":""},{"$f":"IF($A134=\"\",\"\",VLOOKUP($A134,'MATERIAS PRIMAS'!$A$3:$T$119,N$125,FALSE))","v":""},{"$f":"IF($A134=\"\",\"\",VLOOKUP($A134,'MATERIAS PRIMAS'!$A$3:$T$119,O$125,FALSE))","v":""},{"$f":"IF($A134=\"\",\"\",VLOOKUP($A134,'MATERIAS PRIMAS'!$A$3:$T$119,P$125,FALSE))","v":""},{"$f":"IF($A134=\"\",\"\",VLOOKUP($A134,'MATERIAS PRIMAS'!$A$3:$T$119,Q$125,FALSE))","v":""},{"$f":"IF($A134=\"\",\"\",VLOOKUP($A134,'MATERIAS PRIMAS'!$A$3:$T$119,R$125,FALSE))","v":""},{"$f":"IF($A134=\"\",\"\",VLOOKUP($A134,'MATERIAS PRIMAS'!$A$3:$T$119,S$125,FALSE))","v":""},{"$f":"IF($A134=\"\",\"\",VLOOKUP($A134,'MATERIAS PRIMAS'!$A$3:$T$119,T$125,FALSE))","v":""}]
[{"$f":"IF('HACER RACION'!B40=\"\",\"\",'HACER RACION'!B40)","v":""},{"$f":"IF('HACER RACION'!D40=\"\",\"\",'HACER RACION'!D40)","v":""},{"$f":"IF($A135=\"\",\"\",VLOOKUP($A135,'MATERIAS PRIMAS'!$A$3:$T$119,C$125,FALSE))","v":""},{"$f":"IF($A135=\"\",\"\",VLOOKUP($A135,'MATERIAS PRIMAS'!$A$3:$T$119,D$125,FALSE))","v":""},{"$f":"IF($A135=\"\",\"\",VLOOKUP($A135,'MATERIAS PRIMAS'!$A$3:$T$119,E$125,FALSE))","v":""},{"$f":"IF($A135=\"\",\"\",VLOOKUP($A135,'MATERIAS PRIMAS'!$A$3:$T$119,F$125,FALSE))","v":""},{"$f":"IF($A135=\"\",\"\",VLOOKUP($A135,'MATERIAS PRIMAS'!$A$3:$T$119,G$125,FALSE))","v":""},{"$f":"IF($A135=\"\",\"\",VLOOKUP($A135,'MATERIAS PRIMAS'!$A$3:$T$119,H$125,FALSE))","v":""},{"$f":"IF($A135=\"\",\"\",VLOOKUP($A135,'MATERIAS PRIMAS'!$A$3:$T$119,I$125,FALSE))","v":""},{"$f":"IF($A135=\"\",\"\",VLOOKUP($A135,'MATERIAS PRIMAS'!$A$3:$T$119,J$125,FALSE))","v":""},{"$f":"IF($A135=\"\",\"\",VLOOKUP($A135,'MATERIAS PRIMAS'!$A$3:$T$119,K$125,FALSE))","v":""},{"$f":"IF($A135=\"\",\"\",VLOOKUP($A135,'MATERIAS PRIMAS'!$A$3:$T$119,L$125,FALSE))","v":""},{"$f":"IF($A135=\"\",\"\",VLOOKUP($A135,'MATERIAS PRIMAS'!$A$3:$T$119,M$125,FALSE))","v":""},{"$f":"IF($A135=\"\",\"\",VLOOKUP($A135,'MATERIAS PRIMAS'!$A$3:$T$119,N$125,FALSE))","v":""},{"$f":"IF($A135=\"\",\"\",VLOOKUP($A135,'MATERIAS PRIMAS'!$A$3:$T$119,O$125,FALSE))","v":""},{"$f":"IF($A135=\"\",\"\",VLOOKUP($A135,'MATERIAS PRIMAS'!$A$3:$T$119,P$125,FALSE))","v":""},{"$f":"IF($A135=\"\",\"\",VLOOKUP($A135,'MATERIAS PRIMAS'!$A$3:$T$119,Q$125,FALSE))","v":""},{"$f":"IF($A135=\"\",\"\",VLOOKUP($A135,'MATERIAS PRIMAS'!$A$3:$T$119,R$125,FALSE))","v":""},{"$f":"IF($A135=\"\",\"\",VLOOKUP($A135,'MATERIAS PRIMAS'!$A$3:$T$119,S$125,FALSE))","v":""},{"$f":"IF($A135=\"\",\"\",VLOOKUP($A135,'MATERIAS PRIMAS'!$A$3:$T$119,T$125,FALSE))","v":""}]
[{"$f":"IF('HACER RACION'!B41=\"\",\"\",'HACER RACION'!B41)","v":""},{"$f":"IF('HACER RACION'!D41=\"\",\"\",'HACER RACION'!D41)","v":""},{"$f":"IF($A136=\"\",\"\",VLOOKUP($A136,'MATERIAS PRIMAS'!$A$3:$T$119,C$125,FALSE))","v":""},{"$f":"IF($A136=\"\",\"\",VLOOKUP($A136,'MATERIAS PRIMAS'!$A$3:$T$119,D$125,FALSE))","v":""},{"$f":"IF($A136=\"\",\"\",VLOOKUP($A136,'MATERIAS PRIMAS'!$A$3:$T$119,E$125,FALSE))","v":""},{"$f":"IF($A136=\"\",\"\",VLOOKUP($A136,'MATERIAS PRIMAS'!$A$3:$T$119,F$125,FALSE))","v":""},{"$f":"IF($A136=\"\",\"\",VLOOKUP($A136,'MATERIAS PRIMAS'!$A$3:$T$119,G$125,FALSE))","v":""},{"$f":"IF($A136=\"\",\"\",VLOOKUP($A136,'MATERIAS PRIMAS'!$A$3:$T$119,H$125,FALSE))","v":""},{"$f":"IF($A136=\"\",\"\",VLOOKUP($A136,'MATERIAS PRIMAS'!$A$3:$T$119,I$125,FALSE))","v":""},{"$f":"IF($A136=\"\",\"\",VLOOKUP($A136,'MATERIAS PRIMAS'!$A$3:$T$119,J$125,FALSE))","v":""},{"$f":"IF($A136=\"\",\"\",VLOOKUP($A136,'MATERIAS PRIMAS'!$A$3:$T$119,K$125,FALSE))","v":""},{"$f":"IF($A136=\"\",\"\",VLOOKUP($A136,'MATERIAS PRIMAS'!$A$3:$T$119,L$125,FALSE))","v":""},{"$f":"IF($A136=\"\",\"\",VLOOKUP($A136,'MATERIAS PRIMAS'!$A$3:$T$119,M$125,FALSE))","v":""},{"$f":"IF($A136=\"\",\"\",VLOOKUP($A136,'MATERIAS PRIMAS'!$A$3:$T$119,N$125,FALSE))","v":""},{"$f":"IF($A136=\"\",\"\",VLOOKUP($A136,'MATERIAS PRIMAS'!$A$3:$T$119,O$125,FALSE))","v":""},{"$f":"IF($A136=\"\",\"\",VLOOKUP($A136,'MATERIAS PRIMAS'!$A$3:$T$119,P$125,FALSE))","v":""},{"$f":"IF($A136=\"\",\"\",VLOOKUP($A136,'MATERIAS PRIMAS'!$A$3:$T$119,Q$125,FALSE))","v":""},{"$f":"IF($A136=\"\",\"\",VLOOKUP($A136,'MATERIAS PRIMAS'!$A$3:$T$119,R$125,FALSE))","v":""},{"$f":"IF($A136=\"\",\"\",VLOOKUP($A136,'MATERIAS PRIMAS'!$A$3:$T$119,S$125,FALSE))","v":""},{"$f":"IF($A136=\"\",\"\",VLOOKUP($A136,'MATERIAS PRIMAS'!$A$3:$T$119,T$125,FALSE))","v":""}]
[{"$f":"IF('HACER RACION'!B42=\"\",\"\",'HACER RACION'!B42)","v":""},{"$f":"IF('HACER RACION'!D42=\"\",\"\",'HACER RACION'!D42)","v":""},{"$f":"IF($A137=\"\",\"\",VLOOKUP($A137,'MATERIAS PRIMAS'!$A$3:$T$119,C$125,FALSE))","v":""},{"$f":"IF($A137=\"\",\"\",VLOOKUP($A137,'MATERIAS PRIMAS'!$A$3:$T$119,D$125,FALSE))","v":""},{"$f":"IF($A137=\"\",\"\",VLOOKUP($A137,'MATERIAS PRIMAS'!$A$3:$T$119,E$125,FALSE))","v":""},{"$f":"IF($A137=\"\",\"\",VLOOKUP($A137,'MATERIAS PRIMAS'!$A$3:$T$119,F$125,FALSE))","v":""},{"$f":"IF($A137=\"\",\"\",VLOOKUP($A137,'MATERIAS PRIMAS'!$A$3:$T$119,G$125,FALSE))","v":""},{"$f":"IF($A137=\"\",\"\",VLOOKUP($A137,'MATERIAS PRIMAS'!$A$3:$T$119,H$125,FALSE))","v":""},{"$f":"IF($A137=\"\",\"\",VLOOKUP($A137,'MATERIAS PRIMAS'!$A$3:$T$119,I$125,FALSE))","v":""},{"$f":"IF($A137=\"\",\"\",VLOOKUP($A137,'MATERIAS PRIMAS'!$A$3:$T$119,J$125,FALSE))","v":""},{"$f":"IF($A137=\"\",\"\",VLOOKUP($A137,'MATERIAS PRIMAS'!$A$3:$T$119,K$125,FALSE))","v":""},{"$f":"IF($A137=\"\",\"\",VLOOKUP($A137,'MATERIAS PRIMAS'!$A$3:$T$119,L$125,FALSE))","v":""},{"$f":"IF($A137=\"\",\"\",VLOOKUP($A137,'MATERIAS PRIMAS'!$A$3:$T$119,M$125,FALSE))","v":""},{"$f":"IF($A137=\"\",\"\",VLOOKUP($A137,'MATERIAS PRIMAS'!$A$3:$T$119,N$125,FALSE))","v":""},{"$f":"IF($A137=\"\",\"\",VLOOKUP($A137,'MATERIAS PRIMAS'!$A$3:$T$119,O$125,FALSE))","v":""},{"$f":"IF($A137=\"\",\"\",VLOOKUP($A137,'MATERIAS PRIMAS'!$A$3:$T$119,P$125,FALSE))","v":""},{"$f":"IF($A137=\"\",\"\",VLOOKUP($A137,'MATERIAS PRIMAS'!$A$3:$T$119,Q$125,FALSE))","v":""},{"$f":"IF($A137=\"\",\"\",VLOOKUP($A137,'MATERIAS PRIMAS'!$A$3:$T$119,R$125,FALSE))","v":""},{"$f":"IF($A137=\"\",\"\",VLOOKUP($A137,'MATERIAS PRIMAS'!$A$3:$T$119,S$125,FALSE))","v":""},{"$f":"IF($A137=\"\",\"\",VLOOKUP($A137,'MATERIAS PRIMAS'!$A$3:$T$119,T$125,FALSE))","v":""}]
[{"$f":"IF('HACER RACION'!B43=\"\",\"\",'HACER RACION'!B43)","v":""},{"$f":"IF('HACER RACION'!D43=\"\",\"\",'HACER RACION'!D43)","v":""},{"$f":"IF($A138=\"\",\"\",VLOOKUP($A138,'MATERIAS PRIMAS'!$A$3:$T$119,C$125,FALSE))","v":""},{"$f":"IF($A138=\"\",\"\",VLOOKUP($A138,'MATERIAS PRIMAS'!$A$3:$T$119,D$125,FALSE))","v":""},{"$f":"IF($A138=\"\",\"\",VLOOKUP($A138,'MATERIAS PRIMAS'!$A$3:$T$119,E$125,FALSE))","v":""},{"$f":"IF($A138=\"\",\"\",VLOOKUP($A138,'MATERIAS PRIMAS'!$A$3:$T$119,F$125,FALSE))","v":""},{"$f":"IF($A138=\"\",\"\",VLOOKUP($A138,'MATERIAS PRIMAS'!$A$3:$T$119,G$125,FALSE))","v":""},{"$f":"IF($A138=\"\",\"\",VLOOKUP($A138,'MATERIAS PRIMAS'!$A$3:$T$119,H$125,FALSE))","v":""},{"$f":"IF($A138=\"\",\"\",VLOOKUP($A138,'MATERIAS PRIMAS'!$A$3:$T$119,I$125,FALSE))","v":""},{"$f":"IF($A138=\"\",\"\",VLOOKUP($A138,'MATERIAS PRIMAS'!$A$3:$T$119,J$125,FALSE))","v":""},{"$f":"IF($A138=\"\",\"\",VLOOKUP($A138,'MATERIAS PRIMAS'!$A$3:$T$119,K$125,FALSE))","v":""},{"$f":"IF($A138=\"\",\"\",VLOOKUP($A138,'MATERIAS PRIMAS'!$A$3:$T$119,L$125,FALSE))","v":""},{"$f":"IF($A138=\"\",\"\",VLOOKUP($A138,'MATERIAS PRIMAS'!$A$3:$T$119,M$125,FALSE))","v":""},{"$f":"IF($A138=\"\",\"\",VLOOKUP($A138,'MATERIAS PRIMAS'!$A$3:$T$119,N$125,FALSE))","v":""},{"$f":"IF($A138=\"\",\"\",VLOOKUP($A138,'MATERIAS PRIMAS'!$A$3:$T$119,O$125,FALSE))","v":""},{"$f":"IF($A138=\"\",\"\",VLOOKUP($A138,'MATERIAS PRIMAS'!$A$3:$T$119,P$125,FALSE))","v":""},{"$f":"IF($A138=\"\",\"\",VLOOKUP($A138,'MATERIAS PRIMAS'!$A$3:$T$119,Q$125,FALSE))","v":""},{"$f":"IF($A138=\"\",\"\",VLOOKUP($A138,'MATERIAS PRIMAS'!$A$3:$T$119,R$125,FALSE))","v":""},{"$f":"IF($A138=\"\",\"\",VLOOKUP($A138,'MATERIAS PRIMAS'!$A$3:$T$119,S$125,FALSE))","v":""},{"$f":"IF($A138=\"\",\"\",VLOOKUP($A138,'MATERIAS PRIMAS'!$A$3:$T$119,T$125,FALSE))","v":""}]
[{"$f":"IF('HACER RACION'!B44=\"\",\"\",'HACER RACION'!B44)","v":""},{"$f":"IF('HACER RACION'!D44=\"\",\"\",'HACER RACION'!D44)","v":""},{"$f":"IF($A139=\"\",\"\",VLOOKUP($A139,'MATERIAS PRIMAS'!$A$3:$T$119,C$125,FALSE))","v":""},{"$f":"IF($A139=\"\",\"\",VLOOKUP($A139,'MATERIAS PRIMAS'!$A$3:$T$119,D$125,FALSE))","v":""},{"$f":"IF($A139=\"\",\"\",VLOOKUP($A139,'MATERIAS PRIMAS'!$A$3:$T$119,E$125,FALSE))","v":""},{"$f":"IF($A139=\"\",\"\",VLOOKUP($A139,'MATERIAS PRIMAS'!$A$3:$T$119,F$125,FALSE))","v":""},{"$f":"IF($A139=\"\",\"\",VLOOKUP($A139,'MATERIAS PRIMAS'!$A$3:$T$119,G$125,FALSE))","v":""},{"$f":"IF($A139=\"\",\"\",VLOOKUP($A139,'MATERIAS PRIMAS'!$A$3:$T$119,H$125,FALSE))","v":""},{"$f":"IF($A139=\"\",\"\",VLOOKUP($A139,'MATERIAS PRIMAS'!$A$3:$T$119,I$125,FALSE))","v":""},{"$f":"IF($A139=\"\",\"\",VLOOKUP($A139,'MATERIAS PRIMAS'!$A$3:$T$119,J$125,FALSE))","v":""},{"$f":"IF($A139=\"\",\"\",VLOOKUP($A139,'MATERIAS PRIMAS'!$A$3:$T$119,K$125,FALSE))","v":""},{"$f":"IF($A139=\"\",\"\",VLOOKUP($A139,'MATERIAS PRIMAS'!$A$3:$T$119,L$125,FALSE))","v":""},{"$f":"IF($A139=\"\",\"\",VLOOKUP($A139,'MATERIAS PRIMAS'!$A$3:$T$119,M$125,FALSE))","v":""},{"$f":"IF($A139=\"\",\"\",VLOOKUP($A139,'MATERIAS PRIMAS'!$A$3:$T$119,N$125,FALSE))","v":""},{"$f":"IF($A139=\"\",\"\",VLOOKUP($A139,'MATERIAS PRIMAS'!$A$3:$T$119,O$125,FALSE))","v":""},{"$f":"IF($A139=\"\",\"\",VLOOKUP($A139,'MATERIAS PRIMAS'!$A$3:$T$119,P$125,FALSE))","v":""},{"$f":"IF($A139=\"\",\"\",VLOOKUP($A139,'MATERIAS PRIMAS'!$A$3:$T$119,Q$125,FALSE))","v":""},{"$f":"IF($A139=\"\",\"\",VLOOKUP($A139,'MATERIAS PRIMAS'!$A$3:$T$119,R$125,FALSE))","v":""},{"$f":"IF($A139=\"\",\"\",VLOOKUP($A139,'MATERIAS PRIMAS'!$A$3:$T$119,S$125,FALSE))","v":""},{"$f":"IF($A139=\"\",\"\",VLOOKUP($A139,'MATERIAS PRIMAS'!$A$3:$T$119,T$125,FALSE))","v":""}]
[]
[]
["Descripción resumida","Kg/dia","MS*","PB*","FB*","GB**","Cenizas*","Almidón am**","Azúcar","FND**","FAD**","LAD**","UFL","UFC","PDIE","PDIN","PDIA","Ca","P","Humedad"]
[{"$f":"IF(A127=\"\",\"\",A127)","v":""},{"$f":"IF(B127=\"\",\"\",B127)","v":""},{"$f":"IF(B127=\"\",0,C127*$B127)","v":0},{"$f":"IF(C127=\"\",0,D127*($C127/1000)*$B127)","v":0},{"$f":"IF(D127=\"\",0,E127*($C127/1000)*$B127)","v":0},0,0,0,0,0,0,0,0,0,0,0,0,0,0,0]
[{"$f":"IF(A128=\"\",\"\",A128)","v":""},"",{"$f":"IF(B128=\"\",0,C128*$B128)","v":0},{"$f":"IF(C128=\"\",0,D128*($C128/1000)*$B128)","v":0},0,0,0,0,0,0,0,0,0,0,0,0,0,0,0,0]
["","",{"$f":"IF(B129=\"\",0,C129*$B129)","v":0},{"$f":"IF(C129=\"\",0,D129*($C129/1000)*$B129)","v":0},0,0,0,0,0,0,0,0,0,0,0,0,0,0,0,0]
["","",{"$f":"IF(B130=\"\",0,C130*$B130)","v":0},{"$f":"IF(C130=\"\",0,D130*($C130/1000)*$B130)","v":0},{"$f":"IF(D130=\"\",0,E130*($C130/1000)*$B130)","v":0},0,0,0,0,0,0,0,0,0,0,0,0,0,0,0]
["","",{"$f":"IF(B131=\"\",0,C131*$B131)","v":0},{"$f":"IF(C131=\"\",0,D131*($C131/1000)*$B131)","v":0},0,0,0,0,0,0,0,0,0,0,0,0,0,0,0,0]
["","",{"$f":"IF(B132=\"\",0,C132*$B132)","v":0},{"$f":"IF(C132=\"\",0,D132*($C132/1000)*$B132)","v":0},0,0,0,0,0,0,0,0,0,0,0,0,0,0,0,0]
["","",{"$f":"IF(B133=\"\",0,C133*$B133)","v":0},{"$f":"IF(C133=\"\",0,D133*($C133/1000)*$B133)","v":0},0,0,0,0,0,0,0,0,0,0,0,0,0,0,0,0]
["","",{"$f":"IF(B134=\"\",0,C134*$B134)","v":0},{"$f":"IF(C134=\"\",0,D134*($C134/1000)*$B134)","v":0},0,0,0,0,0,0,0,0,0,0,0,0,0,0,0,0]
["","",{"$f":"IF(B135=\"\",0,C135*$B135)","v":0},{"$f":"IF(C135=\"\",0,D135*($C135/1000)*$B135)","v":0},0,0,0,0,0,0,0,0,0,0,0,0,0,0,0,0]
["","",{"$f":"IF(B136=\"\",0,C136*$B136)","v":0},{"$f":"IF(C136=\"\",0,D136*($C136/1000)*$B136)","v":0},0,0,0,0,0,0,0,0,0,0,0,0,0,0,0,0]
["","",{"$f":"IF(B137=\"\",0,C137*$B137)","v":0},{"$f":"IF(C137=\"\",0,D137*($C137/1000)*$B137)","v":0},0,0,0,0,0,0,0,0,0,0,0,0,0,0,0,0]
["","",{"$f":"IF(B138=\"\",0,C138*$B138)","v":0},{"$f":"IF(C138=\"\",0,D138*($C138/1000)*$B138)","v":0},0,0,0,0,0,0,0,0,0,0,0,0,0,0,0,0]
["","",{"$f":"IF(B139=\"\",0,C139*$B139)","v":0},{"$f":"IF(C139=\"\",0,D139*($C139/1000)*$B139)","v":0},0,0,0,0,0,0,0,0,0,0,0,0,0,0,0,0]
[null,{"$f":"SUM(B143:B155)","v":0},{"$f":"SUM(C143:C155)","v":0},{"$f":"SUM(D143:D155)","v":0},0,0,0,0,0,0,0,0,0,0,0,0,0,0,0,0]
[{"$f":"IF('HACER RACION'!C45=\"\",\"\",'HACER RACION'!C45)","v":""},"Personalizada",{"$f":"1000-T157","v":{"$error":"#DIV/0!"}},{"$f":"D156/$C$158","v":{"$error":"#DIV/0!"}},{"$error":"#DIV/0!"},{"$error":"#DIV/0!"},{"$error":"#DIV/0!"},{"$error":"#DIV/0!"},{"$error":"#DIV/0!"},{"$error":"#DIV/0!"},{"$error":"#DIV/0!"},{"$error":"#DIV/0!"},{"$error":"#DIV/0!"},{"$error":"#DIV/0!"},{"$error":"#DIV/0!"},{"$error":"#DIV/0!"},{"$error":"#DIV/0!"},{"$error":"#DIV/0!"},{"$error":"#DIV/0!"},{"$error":"#DIV/0!"}]
[null,null,{"$f":"C156/1000","v":0}]
[]
["NUTRIENTE","UNIDADES","TOTAL","SSS"]
["Kg/dia","Kg/dia",{"$f":"HLOOKUP(A161,$A$142:$T$157,15,FALSE)","v":0}]
["MS*","gr/dia",0,{"$f":"IF(C162=\"\",\"\",1000)","v":1000}]
["UF","UF/dia",{"$f":"(C177*0.65)+(C178*0.35)","v":0},{"$f":"C163/(C162/1000)","v":{"$error":"#DIV/0!"}}]
["PDIE","gr/dia",{"$f":"HLOOKUP(A164,$A$142:$T$157,15,FALSE)","v":0},{"$f":"HLOOKUP(A164,$A$142:$T$157,16,FALSE)","v":{"$error":"#DIV/0!"}}]
["PDIN","gr/dia",0,{"$error":"#DIV/0!"}]
["FND**","gr/dia",0,{"$error":"#DIV/0!"}]
["GB**","gr/dia",0,{"$error":"#DIV/0!"}]
["Ca","gr/dia",0,{"$error":"#DIV/0!"}]
["P","gr/dia",0,{"$error":"#DIV/0!"}]
["PB*","gr/dia",0,{"$error":"#DIV/0!"}]
["FB*","gr/dia",0,{"$error":"#DIV/0!"}]
["Cenizas*","gr/dia",0,{"$error":"#DIV/0!"}]
["Almidón am**","gr/dia",0,{"$error":"#DIV/0!"}]
["Azúcar","gr/dia",0,{"$error":"#DIV/0!"}]
["FAD**","gr/dia",0,{"$error":"#DIV/0!"}]
["LAD**","gr/dia",0,{"$error":"#DIV/0!"}]
["UFL","UFL/dia",0,{"$error":"#DIV/0!"}]
["UFC","UFC/dia",0,{"$error":"#DIV/0!"}]
["PDIA","gr/dia",0,{"$error":"#DIV/0!"}]
["Humedad","gr/dia",0,{"$error":"#DIV/0!"}]
["Humedad (%)","%",null,{"$f":"D180/D162","v":{"$error":"#DIV/0!"}}]
[]
[]
["UF/kg MS",{"$f":"D163","v":{"$error":"#DIV/0!"}}]
["PB/kg MS",{"$f":"D170/1000","v":{"$error":"#DIV/0!"}}]
["GB/kg MS",{"$f":"D167/1000","v":{"$error":"#DIV/0!"}}]
["FB/kg MS",{"$f":"D171/1000","v":{"$error":"#DIV/0!"}}]
["Almidón/kg MS",{"$f":"D173/1000","v":{"$error":"#DIV/0!"}}]
["Azucar/Kg MS",{"$f":"D174/1000","v":{"$error":"#DIV/0!"}}]
["Alm+Su/kg MS",{"$f":"B188+B189","v":{"$error":"#DIV/0!"}}]

{"sheet":"RACIONES","index":9,"n_rows":27,"n_cols":10,"rows_kept":27,"cut":false,"hidden":false,"merged":[[18,2,18,3],[19,2,19,3],[20,2,20,3],[6,2,6,3],[13,2,13,3],[14,2,14,3],[15,2,15,3],[16,2,16,3],[17,2,17,3],[23,8,23,9],[24,8,24,9],[26,8,27,9],[1,8,1,9],[6,8,7,8]]}
[]
[null,null,null,null,null,null,null,null,"VALORACION"]
[null,null,null,null,null,null,null,null,{"$f":"IF(J3=\"\",\"\",\"UFL/Kg/MS\")","v":""},{"$f":"IF('ENLACES DATOS'!J5=\"\",\"\",'ENLACES DATOS'!J5)","v":""}]
[null,null,null,null,null,null,null,null,{"$f":"IF(J4=\"\",\"\",\"UFC/KgMS\")","v":""},{"$f":"IF('ENLACES DATOS'!J6=\"\",\"\",'ENLACES DATOS'!J6)","v":""}]
[null,"VALORACIÓN RACIONES",null,null,null,null,null,null,{"$f":"IF(J5=\"\",\"\",\"UF/KgMS\")","v":""},{"$f":"IF('ENLACES DATOS'!J7=\"\",\"\",'ENLACES DATOS'!J7)","v":""}]
[null,null,null,null,null,null,"SSS","SSF","% MS RACION"]
[null,"GANADERO",null,null,null,"UF/kg MS"]
[null,"FECHA",null,null,null,"%PB/kg MS"]
[null,null,null,null,null,"%GB/kg MS"]
[null,"GANADO",null,null,null,"%FB/kg MS"]
[null,"APTITUD",null,null,null,"%Almidón/kg MS"]
[null,"RANGO CONFIANZA",null,null,null,"%Azucar/Kg MS"]
[]
[null,"NUTRIENTE","UTILIDAD",null,"VALOR","REFERENCIA","LIM.MINIMO","LIM.MAXIMO","R","% VARIAB."]
[null,{"$f":"IF('ENLACES DATOS'!O2=\"\",\"\",'ENLACES DATOS'!O2)","v":"N_CHO_RD/kg MS"},{"$f":"IF('ENLACES DATOS'!Q2=\"\",\"\",'ENLACES DATOS'!Q2)","v":""},null,{"$f":"IF('ENLACES DATOS'!R2=\"\",\"\",'ENLACES DATOS'!R2)","v":""},{"$f":"IF('ENLACES DATOS'!S2=\"\",\"\",'ENLACES DATOS'!S2)","v":""},{"$f":"IF('ENLACES DATOS'!T2=\"\",\"\",'ENLACES DATOS'!T2)","v":""},{"$f":"IF('ENLACES DATOS'!U2=\"\",\"\",'ENLACES DATOS'!U2)","v":""},{"$f":"IF('ENLACES DATOS'!V2=\"\",\"\",'ENLACES DATOS'!V2)","v":""},{"$f":"IF('ENLACES DATOS'!W2=\"\",\"\",'ENLACES DATOS'!W2)","v":""}]
[null,{"$f":"IF('ENLACES DATOS'!O3=\"\",\"\",'ENLACES DATOS'!O3)","v":"RUMIA IDX/kg MS"},{"$f":"IF('ENLACES DATOS'!Q3=\"\",\"\",'ENLACES DATOS'!Q3)","v":""},null,{"$f":"IF('ENLACES DATOS'!R3=\"\",\"\",'ENLACES DATOS'!R3)","v":""},{"$f":"IF('ENLACES DATOS'!S3=\"\",\"\",'ENLACES DATOS'!S3)","v":""},{"$f":"IF('ENLACES DATOS'!T3=\"\",\"\",'ENLACES DATOS'!T3)","v":""},{"$f":"IF('ENLACES DATOS'!U3=\"\",\"\",'ENLACES DATOS'!U3)","v":""},{"$f":"IF('ENLACES DATOS'!V3=\"\",\"\",'ENLACES DATOS'!V3)","v":""},{"$f":"IF('ENLACES DATOS'!W3=\"\",\"\",'ENLACES DATOS'!W3)","v":""}]
[null,{"$f":"IF('ENLACES DATOS'!O4=\"\",\"\",'ENLACES DATOS'!O4)","v":"ACID INDEX/kg MS"},{"$f":"IF('ENLACES DATOS'!Q4=\"\",\"\",'ENLACES DATOS'!Q4)","v":""},null,{"$f":"IF('ENLACES DATOS'!R4=\"\",\"\",'ENLACES DATOS'!R4)","v":""},{"$f":"IF('ENLACES DATOS'!S4=\"\",\"\",'ENLACES DATOS'!S4)","v":""},{"$f":"IF('ENLACES DATOS'!T4=\"\",\"\",'ENLACES DATOS'!T4)","v":""},{"$f":"IF('ENLACES DATOS'!U4=\"\",\"\",'ENLACES DATOS'!U4)","v":""},{"$f":"IF('ENLACES DATOS'!V4=\"\",\"\",'ENLACES DATOS'!V4)","v":""},{"$f":"IF('ENLACES DATOS'!W4=\"\",\"\",'ENLACES DATOS'!W4)","v":""}]
[null,{"$f":"IF('ENLACES DATOS'!O5=\"\",\"\",'ENLACES DATOS'!O5)","v":"N_CET/kg MS"},{"$f":"IF('ENLACES DATOS'!Q5=\"\",\"\",'ENLACES DATOS'!Q5)","v":""},null,{"$f":"IF('ENLACES DATOS'!R5=\"\",\"\",'ENLACES DATOS'!R5)","v":""},{"$f":"IF('ENLACES DATOS'!S5=\"\",\"\",'ENLACES DATOS'!S5)","v":""},{"$f":"IF('ENLACES DATOS'!T5=\"\",\"\",'ENLACES DATOS'!T5)","v":""},{"$f":"IF('ENLACES DATOS'!U5=\"\",\"\",'ENLACES DATOS'!U5)","v":""},{"$f":"IF('ENLACES DATOS'!V5=\"\",\"\",'ENLACES DATOS'!V5)","v":""},{"$f":"IF('ENLACES DATOS'!W5=\"\",\"\",'ENLACES DATOS'!W5)","v":""}]
[null,{"$f":"IF('ENLACES DATOS'!O6=\"\",\"\",'ENLACES DATOS'!O6)","v":"N_GLU/kg MS"},{"$f":"IF('ENLACES DATOS'!Q6=\"\",\"\",'ENLACES DATOS'!Q6)","v":""},null,{"$f":"IF('ENLACES DATOS'!R6=\"\",\"\",'ENLACES DATOS'!R6)","v":""},{"$f":"IF('ENLACES DATOS'!S6=\"\",\"\",'ENLACES DATOS'!S6)","v":""},{"$f":"IF('ENLACES DATOS'!T6=\"\",\"\",'ENLACES DATOS'!T6)","v":""},{"$f":"IF('ENLACES DATOS'!U6=\"\",\"\",'ENLACES DATOS'!U6)","v":""},{"$f":"IF('ENLACES DATOS'!V6=\"\",\"\",'ENLACES DATOS'!V6)","v":""},{"$f":"IF('ENLACES DATOS'!W6=\"\",\"\",'ENLACES DATOS'!W6)","v":""}]
[null,{"$f":"IF('ENLACES DATOS'!O7=\"\",\"\",'ENLACES DATOS'!O7)","v":"N-END/Kg MS"},{"$f":"IF('ENLACES DATOS'!Q7=\"\",\"\",'ENLACES DATOS'!Q7)","v":""},null,{"$f":"IF('ENLACES DATOS'!R7=\"\",\"\",'ENLACES DATOS'!R7)","v":""},{"$f":"IF('ENLACES DATOS'!S7=\"\",\"\",'ENLACES DATOS'!S7)","v":""},{"$f":"IF('ENLACES DATOS'!T7=\"\",\"\",'ENLACES DATOS'!T7)","v":""},{"$f":"IF('ENLACES DATOS'!U7=\"\",\"\",'ENLACES DATOS'!U7)","v":""},{"$f":"IF('ENLACES DATOS'!V7=\"\",\"\",'ENLACES DATOS'!V7)","v":""},{"$f":"IF('ENLACES DATOS'!W7=\"\",\"\",'ENLACES DATOS'!W7)","v":""}]
[null,{"$f":"IF('ENLACES DATOS'!O8=\"\",\"\",'ENLACES DATOS'!O8)","v":"N-BPD/Kg MS"},{"$f":"IF('ENLACES DATOS'!Q8=\"\",\"\",'ENLACES DATOS'!Q8)","v":""},null,{"$f":"IF('ENLACES DATOS'!R8=\"\",\"\",'ENLACES DATOS'!R8)","v":""},{"$f":"IF('ENLACES DATOS'!S8=\"\",\"\",'ENLACES DATOS'!S8)","v":""},{"$f":"IF('ENLACES DATOS'!T8=\"\",\"\",'ENLACES DATOS'!T8)","v":""},{"$f":"IF('ENLACES DATOS'!U8=\"\",\"\",'ENLACES DATOS'!U8)","v":""},{"$f":"IF('ENLACES DATOS'!V8=\"\",\"\",'ENLACES DATOS'!V8)","v":""},{"$f":"IF('ENLACES DATOS'!W8=\"\",\"\",'ENLACES DATOS'!W8)","v":""}]
[]
[]
[null,null,null,null,null,null,null,null,"NUTRIENTE"]
[]
[]
[null,null,null,null,null,null,null,null,{"$f":"IF(I25=\"\",\"\",'ENLACES DATOS'!Q12)","v":""}]

{"sheet":"PIENSOS","index":10,"n_rows":27,"n_cols":10,"rows_kept":27,"cut":false,"hidden":false,"merged":[[24,8,24,9],[23,8,23,9],[26,8,27,9],[5,8,5,9],[17,2,17,3],[18,2,18,3],[19,2,19,3],[20,2,20,3],[6,2,6,3],[13,2,13,3],[14,2,14,3],[15,2,15,3],[16,2,16,3]]}
[]
[]
[]
[]
[null,"VALORACIÓN PIENSOS"]
[null,null,null,null,null,null,"SSF",null,"VALORACION"]
[null,"GANADERO",null,null,null,"UF",null,null,{"$f":"IF(J7=\"\",\"\",\"UFL\")","v":""},{"$f":"IF('ENLACES DATOS'!H39=\"\",\"\",'ENLACES DATOS'!H39)","v":""}]
[null,"FECHA",null,null,null,"PB",null,null,{"$f":"IF(J8=\"\",\"\",\"UFV\")","v":""},{"$f":"IF('ENLACES DATOS'!H40=\"\",\"\",'ENLACES DATOS'!H40)","v":""}]
[null,null,null,null,null,"GB",null,null,{"$f":"IF(J9=\"\",\"\",\"UF\")","v":""},{"$f":"IF('ENLACES DATOS'!H41=\"\",\"\",'ENLACES DATOS'!H41)","v":""}]
[null,"ESPECIFICIDAD",null,null,null,"FB"]
[null,"RANGO CONFIANZA",null,null,null,"Cenizas"]
[null,null,null,null,null,"Almidon"]
[]
[null,"NUTRIENTE","UTILIDAD",null,"VALOR","REFERENCIA","LIM.MINIMO","LIM.MAXIMO","R","% VARIAB."]
[null,"N_CHO_RD",{"$f":"IF('ENLACES DATOS'!Q49=\"\",\"\",'ENLACES DATOS'!Q49)","v":""},null,{"$f":"IF('ENLACES DATOS'!R49=\"\",\"\",'ENLACES DATOS'!R49)","v":""},{"$f":"IF('ENLACES DATOS'!S49=\"\",\"\",'ENLACES DATOS'!S49)","v":""},{"$f":"IF('ENLACES DATOS'!T49=\"\",\"\",'ENLACES DATOS'!T49)","v":""},{"$f":"IF('ENLACES DATOS'!U49=\"\",\"\",'ENLACES DATOS'!U49)","v":""},{"$f":"IF('ENLACES DATOS'!V49=\"\",\"\",'ENLACES DATOS'!V49)","v":""},{"$f":"IF('ENLACES DATOS'!W49=\"\",\"\",'ENLACES DATOS'!W49)","v":""}]
[null,"RUMIA IDX",{"$f":"IF('ENLACES DATOS'!Q50=\"\",\"\",'ENLACES DATOS'!Q50)","v":""},null,{"$f":"IF('ENLACES DATOS'!R50=\"\",\"\",'ENLACES DATOS'!R50)","v":""},{"$f":"IF('ENLACES DATOS'!S50=\"\",\"\",'ENLACES DATOS'!S50)","v":""},{"$f":"IF('ENLACES DATOS'!T50=\"\",\"\",'ENLACES DATOS'!T50)","v":""},{"$f":"IF('ENLACES DATOS'!U50=\"\",\"\",'ENLACES DATOS'!U50)","v":""},{"$f":"IF('ENLACES DATOS'!V50=\"\",\"\",'ENLACES DATOS'!V50)","v":""},{"$f":"IF('ENLACES DATOS'!W50=\"\",\"\",'ENLACES DATOS'!W50)","v":""}]
[null,"ACID INDEX",{"$f":"IF('ENLACES DATOS'!Q51=\"\",\"\",'ENLACES DATOS'!Q51)","v":""},null,{"$f":"IF('ENLACES DATOS'!R51=\"\",\"\",'ENLACES DATOS'!R51)","v":""},{"$f":"IF('ENLACES DATOS'!S51=\"\",\"\",'ENLACES DATOS'!S51)","v":""},{"$f":"IF('ENLACES DATOS'!T51=\"\",\"\",'ENLACES DATOS'!T51)","v":""},{"$f":"IF('ENLACES DATOS'!U51=\"\",\"\",'ENLACES DATOS'!U51)","v":""},{"$f":"IF('ENLACES DATOS'!V51=\"\",\"\",'ENLACES DATOS'!V51)","v":""},{"$f":"IF('ENLACES DATOS'!W51=\"\",\"\",'ENLACES DATOS'!W51)","v":""}]
[null,"N_CET",{"$f":"IF('ENLACES DATOS'!Q52=\"\",\"\",'ENLACES DATOS'!Q52)","v":""},null,{"$f":"IF('ENLACES DATOS'!R52=\"\",\"\",'ENLACES DATOS'!R52)","v":""},{"$f":"IF('ENLACES DATOS'!S52=\"\",\"\",'ENLACES DATOS'!S52)","v":""},{"$f":"IF('ENLACES DATOS'!T52=\"\",\"\",'ENLACES DATOS'!T52)","v":""},{"$f":"IF('ENLACES DATOS'!U52=\"\",\"\",'ENLACES DATOS'!U52)","v":""},{"$f":"IF('ENLACES DATOS'!V52=\"\",\"\",'ENLACES DATOS'!V52)","v":""},{"$f":"IF('ENLACES DATOS'!W52=\"\",\"\",'ENLACES DATOS'!W52)","v":""}]
[null,"N_GLU",{"$f":"IF('ENLACES DATOS'!Q53=\"\",\"\",'ENLACES DATOS'!Q53)","v":""},null,{"$f":"IF('ENLACES DATOS'!R53=\"\",\"\",'ENLACES DATOS'!R53)","v":""},{"$f":"IF('ENLACES DATOS'!S53=\"\",\"\",'ENLACES DATOS'!S53)","v":""},{"$f":"IF('ENLACES DATOS'!T53=\"\",\"\",'ENLACES DATOS'!T53)","v":""},{"$f":"IF('ENLACES DATOS'!U53=\"\",\"\",'ENLACES DATOS'!U53)","v":""},{"$f":"IF('ENLACES DATOS'!V53=\"\",\"\",'ENLACES DATOS'!V53)","v":""},{"$f":"IF('ENLACES DATOS'!W53=\"\",\"\",'ENLACES DATOS'!W53)","v":""}]
[null,"N-END",{"$f":"IF('ENLACES DATOS'!Q54=\"\",\"\",'ENLACES DATOS'!Q54)","v":""},null,{"$f":"IF('ENLACES DATOS'!R54=\"\",\"\",'ENLACES DATOS'!R54)","v":""},{"$f":"IF('ENLACES DATOS'!S54=\"\",\"\",'ENLACES DATOS'!S54)","v":""},{"$f":"IF('ENLACES DATOS'!T54=\"\",\"\",'ENLACES DATOS'!T54)","v":""},{"$f":"IF('ENLACES DATOS'!U54=\"\",\"\",'ENLACES DATOS'!U54)","v":""},{"$f":"IF('ENLACES DATOS'!V54=\"\",\"\",'ENLACES DATOS'!V54)","v":""},{"$f":"IF('ENLACES DATOS'!W54=\"\",\"\",'ENLACES DATOS'!W54)","v":""}]
[null,"N-BPD",{"$f":"IF('ENLACES DATOS'!Q55=\"\",\"\",'ENLACES DATOS'!Q55)","v":""},null,{"$f":"IF('ENLACES DATOS'!R55=\"\",\"\",'ENLACES DATOS'!R55)","v":""},{"$f":"IF('ENLACES DATOS'!S55=\"\",\"\",'ENLACES DATOS'!S55)","v":""},{"$f":"IF('ENLACES DATOS'!T55=\"\",\"\",'ENLACES DATOS'!T55)","v":""},{"$f":"IF('ENLACES DATOS'!U55=\"\",\"\",'ENLACES DATOS'!U55)","v":""},{"$f":"IF('ENLACES DATOS'!V55=\"\",\"\",'ENLACES DATOS'!V55)","v":""},{"$f":"IF('ENLACES DATOS'!W55=\"\",\"\",'ENLACES DATOS'!W55)","v":""}]
[]
[]
[null,null,null,null,null,null,null,null,"NUTRIENTE"]
[]
[]
[null,null,null,null,null,null,null,null,{"$f":"IF(I25=\"\",\"\",'ENLACES DATOS'!Q59)","v":""}]

{"sheet":"HACER RACION","index":11,"n_rows":45,"n_cols":12,"rows_kept":45,"cut":false,"hidden":false,"merged":[[6,2,6,3],[8,7,8,11],[34,1,34,2],[35,1,35,2],[36,1,36,2],[37,1,37,2],[38,1,38,2],[30,1,30,2],[10,9,10,11],[21,7,21,9],[20,3,20,4],[33,1,33,2],[12,1,18,1],[20,1,27,1],[11,1,11,3],[31,1,31,2],[32,1,32,2],[44,2,44,3],[39,1,39,2],[40,1,40,2],[41,1,41,2],[42,1,42,2]]}
[]
[]
[]
[]
[null,"FORMULACIÓN DE DIETA"]
[]
[null,"GANADERO",null,null,null,null,null,"VALORACION NUTRICIONAL"]
[null,"FECHA"]
[null,null,null,null,null,null,null,"COBERTURA NECESIDADES (FEDNA 2009)"]
[null,"RACION",null,null,null,null,null,"NUTRIENTE","UNIDADES","VALOR BRUTO","NECESIDADES","% VARIACIÓN"]
[null,null,null,null,null,null,null,"Ingesta Kg Bruto","Kg/dia",{"$f":"IF($D$32=\"\",\"\",'ENLACES DATOS'!C161)","v":""}]
[null,"DATOS BASICOS DE LOS ANIMALES",null,null,null,null,null,"IMS (KgMS)","Kg/dia",{"$f":"IF($D$32=\"\",\"\",'ENLACES DATOS'!C162/1000)","v":""},{"$f":"IF('ENLACES DATOS'!M103=\"\",\"\",'ENLACES DATOS'!M103)","v":""},{"$f":"IF(K12=\"\",\"\",(J12-K12)/K12)","v":""}]
[null,"CAPRINO","PESO VIVO",null,null,null,null,"UF","UF/dia",{"$f":"IF($D$32=\"\",\"\",'ENLACES DATOS'!C163)","v":""},{"$f":"IF('ENLACES DATOS'!M104=\"\",\"\",'ENLACES DATOS'!M104)","v":""},{"$f":"IF(K13=\"\",\"\",(J13-K13)/K13)","v":""}]
[null,null,"LITROS/DIA",null,null,null,null,"gr PDIE","gramos/dia",{"$f":"IF($D$32=\"\",\"\",'ENLACES DATOS'!C164)","v":""},{"$f":"IF('ENLACES DATOS'!M105=\"\",\"\",'ENLACES DATOS'!M105)","v":""},""]
[null,null,"GRASA LECHE (gramos)",null,null,null,null,"gr PDIN","gramos/dia",{"$f":"IF($D$32=\"\",\"\",'ENLACES DATOS'!C165)","v":""},{"$f":"IF('ENLACES DATOS'!M105=\"\",\"\",'ENLACES DATOS'!M105)","v":""},{"$f":"IF(K15=\"\",\"\",(J15-K15)/K15)","v":""}]
[null,null,"PROTEINA LECHE (gramos)",null,null,null,null,"gr FND","gramos/dia",{"$f":"IF($D$32=\"\",\"\",'ENLACES DATOS'!C166)","v":""},{"$f":"IF('ENLACES DATOS'!M106=\"\",\"\",'ENLACES DATOS'!M106)","v":""},{"$f":"IF(K16=\"\",\"\",(J16-K16)/K16)","v":""}]
[null,null,"MES DE GESTACION",null,null,null,null,"gr GB (máximo)","gramos/dia",{"$f":"IF($D$32=\"\",\"\",'ENLACES DATOS'!C167)","v":""},{"$f":"IF('ENLACES DATOS'!M107=\"\",\"\",'ENLACES DATOS'!M107)","v":""},{"$f":"IF(K17=\"\",\"\",(J17-K17)/K17)","v":""}]
[null,null,"MES DE LACTACION",null,null,null,null,"gr Ca","gramos/dia",{"$f":"IF($D$32=\"\",\"\",'ENLACES DATOS'!C168)","v":""},{"$f":"IF('ENLACES DATOS'!M108=\"\",\"\",'ENLACES DATOS'!M108)","v":""},{"$f":"IF(K18=\"\",\"\",(J18-K18)/K18)","v":""}]
[null,null,"DISTANCIA RECORRIDA (Km)",null,null,null,null,"gr P","gramos/dia",{"$f":"IF($D$32=\"\",\"\",'ENLACES DATOS'!C169)","v":""},{"$f":"IF('ENLACES DATOS'!M109=\"\",\"\",'ENLACES DATOS'!M109)","v":""},{"$f":"IF(K19=\"\",\"\",(J19-K19)/K19)","v":""}]
[]
[null,"OVINO","TIPO OVEJA"]
[null,null,"PESO VIVO",null,null,null,null,"PERFIL NUTRICIONAL"]
[null,null,"LECHE/DIA",null,null,null,null,{"$f":"'ENLACES DATOS'!A181","v":"Humedad (%)"},{"$f":"'ENLACES DATOS'!B181","v":"%"},{"$f":"IF($J$12=\"\",\"\",'ENLACES DATOS'!D181)","v":""}]
[null,null,"GRASA LECHE (gramos)",null,null,null,null,{"$f":"'ENLACES DATOS'!A162","v":"MS*"},{"$f":"'ENLACES DATOS'!B162","v":"gr/dia"},{"$f":"IF($J$12=\"\",\"\",'ENLACES DATOS'!D162)","v":""}]
[null,null,"PROTEINA LECHE (gramos)",null,null,null,null,"NUTRIENTE","UNIDADES","SOBRE M.S."]
[null,null,"PESO CAMADA",null,null,null,null,{"$f":"'ENLACES DATOS'!A163","v":"UF"},{"$f":"'ENLACES DATOS'!B163","v":"UF/dia"},{"$f":"IF($J$12=\"\",\"\",'ENLACES DATOS'!D163)","v":""}]
[null,null,"DIAS GESTACION",null,null,null,null,{"$f":"'ENLACES DATOS'!A170","v":"PB*"},{"$f":"'ENLACES DATOS'!B170","v":"gr/dia"},{"$f":"IF($J$12=\"\",\"\",'ENLACES DATOS'!D170)","v":""}]
[null,null,"TEMPERATURA",null,null,null,null,{"$f":"'ENLACES DATOS'!A164","v":"PDIE"},{"$f":"'ENLACES DATOS'!B164","v":"gr/dia"},{"$f":"IF($J$12=\"\",\"\",'ENLACES DATOS'!D164)","v":""}]
[null,null,null,null,null,null,null,{"$f":"'ENLACES DATOS'!A165","v":"PDIN"},{"$f":"'ENLACES DATOS'!B165","v":"gr/dia"},{"$f":"IF($J$12=\"\",\"\",'ENLACES DATOS'!D165)","v":""}]
[null,null,null,null,null,null,null,{"$f":"'ENLACES DATOS'!A179","v":"PDIA"},{"$f":"'ENLACES DATOS'!B179","v":"gr/dia"},{"$f":"IF($J$12=\"\",\"\",'ENLACES DATOS'!D179)","v":""}]
[null,"INGREDIENTE",null,"KILOS/DIA",null,null,null,{"$f":"'ENLACES DATOS'!A166","v":"FND**"},{"$f":"'ENLACES DATOS'!B166","v":"gr/dia"},{"$f":"IF($J$12=\"\",\"\",'ENLACES DATOS'!D166)","v":""}]
[null,null,null,null,null,null,null,{"$f":"'ENLACES DATOS'!A175","v":"FAD**"},{"$f":"'ENLACES DATOS'!B175","v":"gr/dia"},{"$f":"IF($J$12=\"\",\"\",'ENLACES DATOS'!D175)","v":""}]
[null,null,null,null,null,null,null,{"$f":"'ENLACES DATOS'!A176","v":"LAD**"},{"$f":"'ENLACES DATOS'!B176","v":"gr/dia"},{"$f":"IF($J$12=\"\",\"\",'ENLACES DATOS'!D176)","v":""}]
[null,null,null,null,null,null,null,{"$f":"'ENLACES DATOS'!A171","v":"FB*"},{"$f":"'ENLACES DATOS'!B171","v":"gr/dia"},{"$f":"IF($J$12=\"\",\"\",'ENLACES DATOS'!D171)","v":""}]
[null,null,null,null,null,null,null,{"$f":"'ENLACES DATOS'!A167","v":"GB**"},{"$f":"'ENLACES DATOS'!B167","v":"gr/dia"},{"$f":"IF($J$12=\"\",\"\",'ENLACES DATOS'!D167)","v":""}]
[null,null,null,null,null,null,null,{"$f":"'ENLACES DATOS'!A172","v":"Cenizas*"},{"$f":"'ENLACES DATOS'!B172","v":"gr/dia"},{"$f":"IF($J$12=\"\",\"\",'ENLACES DATOS'!D172)","v":""}]
[null,null,null,null,null,null,null,{"$f":"'ENLACES DATOS'!A173","v":"Almidón am**"},{"$f":"'ENLACES DATOS'!B173","v":"gr/dia"},{"$f":"IF($J$12=\"\",\"\",'ENLACES DATOS'!D173)","v":""}]
[null,null,null,null,null,null,null,{"$f":"'ENLACES DATOS'!A174","v":"Azúcar"},{"$f":"'ENLACES DATOS'!B174","v":"gr/dia"},{"$f":"IF($J$12=\"\",\"\",'ENLACES DATOS'!D174)","v":""}]
[null,null,null,null,null,null,null,{"$f":"'ENLACES DATOS'!A168","v":"Ca"},{"$f":"'ENLACES DATOS'!B168","v":"gr/dia"},{"$f":"IF($J$12=\"\",\"\",'ENLACES DATOS'!D168)","v":""}]
[null,null,null,null,null,null,null,{"$f":"'ENLACES DATOS'!A169","v":"P"},{"$f":"'ENLACES DATOS'!B169","v":"gr/dia"},{"$f":"IF($J$12=\"\",\"\",'ENLACES DATOS'!D169)","v":""}]
[]
[]
[]
[]
[null,"DIETA"]

{"sheet":"INFORMACION NUTRIENTES","index":12,"n_rows":24,"n_cols":5,"rows_kept":24,"cut":false,"hidden":false,"merged":[[21,1,23,1],[14,1,16,1],[17,3,18,3],[17,2,18,2],[17,1,18,1],[19,3,20,3],[19,2,20,2],[19,1,20,1],[14,3,16,3],[14,2,16,2],[21,3,23,3],[21,2,23,2],[7,3,10,3],[7,2,10,2],[7,1,10,1],[11,3,12,3],[11,2,12,2],[11,1,12,1]]}
[]
[]
[]
[]
[null,"INFORMACION NUTRIENTES NUEVO MODELO"]
[]
[null,"NUTRIENTE","SIGNIFICADO","ORIGEN","APLICACIÓN PRÁCTICA"]
[null,"N_CHO_RD","Carbohidratos rápidamente fermentables (0-2 horas).","Se centra sobre todo en almidón y azúcar. Aumenta la fermentabilidad ruminal. Debe estar alineado con los contenidos en proteína degradable.","Aumentar la producción."]
[null,null,null,null,"Puede deprimir la grasa de la leche."]
[null,null,null,null,"Aumentar la ingesta si está por debajo de los mínimos."]
[null,null,null,null,"Aumentar la proteína de la leche."]
[null,"RUMIA IDX","Indice de Rumia. Efectividad de la fibra en facilitar la rumia. Relacionado con la cantidad de saliva producida.","Muy relacionado con la Fibra Efectiva de Maertens. El valor de referencia sería de 100 (es un índice). Indica la capacidad de la dieta para tamponar el rumen.","Valores bajos indican necesidad de fibra larga y de volumen."]
[null,null,null,null,"Valores altos pueden producir rumia lenta y baja ingesta."]
[null,"ACID INDEX","Indice de carga acidógena. Capacidad de la dieta para acidificar el rumen.","Se basa en la produccion de AGV a partir de los HdC y las proteínas fermentables, así como los ácidos de los ensilados.","Valores altos pueden dar bajos test de grasa en leche y riesgo de acidosis."]
[null,"N_CET","Nutrientes cetogénicos.","Basado en el cálculo de acetato, butirato y AG ramificados en panza, así como la grasa de la dieta.","Incrementar en caso si queremos aumentar grasa en leche."]
[null,null,null,null,"Incrementar si queremos aumentar reservas grasas."]
[null,null,null,null,"Disminuir si queremos evitar engrasamiento de animales."]
[null,"N_GLU","Nutrientes glucogénicos precursores de glucosa.","Procede de la producción de propionato, parte de AG ramificados, parte de la proteína y la digestión intestinal del almidón by pass.","Importante en suboptimos inicios de lactación."]
[null,null,null,null,"Aumentar si queremos evitar toxemias de gestación."]
[null,"N-END","Energía dinámica. Es un indice. Tiene en cuenta la digestion en rumen , ID e IG y las interacciones entre nutrientes.","Viene del cómputo de todos los nutrientes absorbidos en los 3 compartimentos digestivos en términos de energía neta.","Buena correlación con la producción de leche."]
[null,null,null,null,"En nuestro modelo de ovino y caprino, al estar calculado mediante regresión, no tiene una aplicación tan precisa como en vacuno."]
[null,"N-BPD","Balance Energía-Proteína Degradable.","Diferencia entre la proteina microbiana disponible y la requerida para la máxima sintesis de proteina microbianana.","Valores menores de 0 indican déficit de proteína fermentable o exceso de energía fermentable."]
[null,null,null,null,"Valores mayores a 0 , exceso de proteina fermentable."]
[null,null,null,null,"Se recomindan valores mayores que 0. "]

{"sheet":"HOJA DE AYUDA","index":13,"n_rows":24,"n_cols":2,"rows_kept":24,"cut":false,"hidden":false,"merged":[]}
[]
[]
[]
[null,"AYUDA E INSTRUCCIONES"]
[]
[]
[]
[null,"1.- GUIA RACIONAMIENTO BASICO"]
[]
[null,"https://youtu.be/0eyiqNHWemk"]
[]
[null,"2.- GUÍA VALORACION DE RACIONES EN NOVALAC"]
[]
[null,"https://youtu.be/AiC9-IRYij0"]
[]
[]
[null,"3.- GUIA VALORACION DE PIENSOS EN NOVALAC"]
[]
[null,"https://youtu.be/cHkW--mUeLo"]
[]
[]
[null,"4.- GUÍA INFORMACIÓN DE NUTRIENTES"]
[]
[null,"https://youtu.be/0sIiMk7IjhE"]

{"sheet":"MODULO","index":14,"n_rows":0,"n_cols":0,"rows_kept":0,"cut":false,"hidden":false,"merged":[]}